{"text_format":"1","workbook":"xlsx","n_sheets":3,"sheets":["Procio","Trocio","ANTOINE"],"not_rendered":{"charts":0,"images":1,"macros":1,"external_links":0,"defined_names":54,"comments":0,"pivot_tables":0},"unopened":[],"bounds":{"document_bytes":16777216,"sheet_cells":100000,"rows_first":2000,"rows_last":500,"rows_between":2000,"halvings":0,"cell_chars":16384,"cell_head_chars":4096},"cells_cut":0,"cells_raw":0,"read":"whole","date_system":"1900"}

{"sheet":"Procio","index":0,"n_rows":21,"n_cols":10,"rows_kept":21,"cut":false,"hidden":false,"merged":[[20,1,20,9],[8,4,8,6],[0,4,0,9],[2,4,2,9],[3,4,3,9],[4,4,4,9],[5,4,5,9],[19,1,19,9]]}
["TERMODINÁMICA DEL EQUILIBRIO",null,null,null,"PUNTOS DE ROCIO"]
["FEDERICO G. SALAZAR"]
[null,null,null,null,"CALCULO DE Procio"]
["N",3,"Número de componentes",null,"PROCEDIMIENTO:"]
["T ",68,"(ºC)",null,"1. Seleccione los números de los componentes en la carpeta ANTOINE"]
["P rocio",{"$f":"1/(B11/H11+B12/H12+IF(B4>=3,B13/H13,0)+IF(B4>=4,B14/H14)+IF(B4>=5,B15/H15)+IF(B4=6,B16/H16))","v":79.768906949617303},"(bar)",null,"2. Ingrese los datos requeridos de las casillas en amarillo"]
[]
[]
[" componente",null,null,null,"log10 Pvap  =  A  -  [B / (T °C +  C)] bar",null,null,"(kPa)","yi P / Psati","yi = zi"]
["No.","zi","Fórmula","componente","A","B","C","Psati  ","xi","yi"]
[1,0.6,{"$f":"LOOKUP(A11,ANTOINE!A22:A93,ANTOINE!C22:C93)","v":"CCl4"},{"$f":"LOOKUP(A11,ANTOINE!$A$22:$A$93,ANTOINE!$B$22:$B$93)","v":"carbon-tetrachloride"},{"$f":"LOOKUP($A11,ANTOINE!$A$22:$A$93,ANTOINE!$D$22:$D$93)","v":6.8940999999999999},{"$f":"LOOKUP($A11,ANTOINE!$A$22:$A$93,ANTOINE!$E$22:$E$93)","v":1219.58},{"$f":"LOOKUP($A11,ANTOINE!$A$22:$A$93,ANTOINE!$F$22:$F$93)","v":227.17},{"$f":"+IF($E$11=0,0,POWER(10,$E$11-($F$11/($B$5+$G$11))))","v":578.51089067359726},{"$f":"+(J11*$B$6)/H11","v":8.2731967438058704E-2},{"$f":"+B11","v":0.6}]
[56,0.3,{"$f":"LOOKUP(A12,ANTOINE!A22:A93,ANTOINE!C22:C93)","v":"C2H3CLO"},{"$f":"LOOKUP(A12,ANTOINE!$A$22:$A$93,ANTOINE!$B$22:$B$93)","v":"acetyl-chloride"},{"$f":"LOOKUP(A12,ANTOINE!$A$22:$A$93,ANTOINE!$D$22:$D$93)","v":6.8407},{"$f":"LOOKUP($A12,ANTOINE!$A$22:$A$93,ANTOINE!$E$22:$E$93)","v":1062.8599999999999},{"$f":"LOOKUP($A12,ANTOINE!$A$22:$A$93,ANTOINE!$F$22:$F$93)","v":217.63},{"$f":"+IF($E12=0,0,POWER(10,$E12-($F12/($B$5+$G12))))","v":1317.0197061469714},{"$f":"+(J12*$B$6)/H12","v":1.817032195736536E-2},0.3]
[34,0.1,{"$f":"IF(A13>0,LOOKUP(A13,ANTOINE!A23:A94,ANTOINE!C23:C94),\" \")","v":"C2CL6"},{"$f":"IF(A13>0,LOOKUP(A13,ANTOINE!$A$22:$A$93,ANTOINE!$B$22:$B$93),\"  \")","v":"hexachloroethane"},{"$f":"IF(A13>0,LOOKUP(A13,ANTOINE!$A$22:$A$93,ANTOINE!$D$22:$D$93),\" \")","v":7.0863300000000002},{"$f":"IF(A13>0,LOOKUP($A13,ANTOINE!$A$22:$A$93,ANTOINE!$E$22:$E$93),\" \")","v":1626.9449999999999},{"$f":"IF(A13>0,LOOKUP($A13,ANTOINE!$A$22:$A$93,ANTOINE!$F$22:$F$93),\" \")","v":197.048},{"$f":"+IF(A13=0,0,POWER(10,$E13-($F13/($B$5+$G13))))","v":8.8721065584716783},{"$f":"+IF($B$4>=3,(J13*$B$6)/H13,0)","v":0.89909771060457611},0.1]
[null,null,{"$f":"IF(A14>0,LOOKUP(A14,ANTOINE!A24:A94,ANTOINE!C24:C94),\" \")","v":" "},{"$f":"IF(A14>0,LOOKUP(A14,ANTOINE!$A$22:$A$93,ANTOINE!$B$22:$B$93),\"  \")","v":"  "},{"$f":"IF(A14>0,LOOKUP(A14,ANTOINE!$A$22:$A$93,ANTOINE!$D$22:$D$93),\" \")","v":" "},{"$f":"IF(A14>0,LOOKUP($A14,ANTOINE!$A$22:$A$93,ANTOINE!$E$22:$E$93),\" \")","v":" "},{"$f":"IF(A14>0,LOOKUP($A14,ANTOINE!$A$22:$A$93,ANTOINE!$F$22:$F$93),\" \")","v":" "},{"$f":"+IF($A14=0,0,POWER(10,$E14-($F14/($B$5+$G14))))","v":0},{"$f":"+IF($B$4>=4,(J14*$B$6)/H14,0)","v":0},0]
[null,null,{"$f":"IF(A15>0,LOOKUP(A15,ANTOINE!A25:A95,ANTOINE!C25:C95),\" \")","v":" "},{"$f":"IF(A15>0,LOOKUP(A15,ANTOINE!$A$22:$A$93,ANTOINE!$B$22:$B$93),\"  \")","v":"  "},{"$f":"IF(A15>0,LOOKUP(A15,ANTOINE!$A$22:$A$93,ANTOINE!$D$22:$D$93),\" \")","v":" "},{"$f":"IF(A15>0,LOOKUP($A15,ANTOINE!$A$22:$A$93,ANTOINE!$E$22:$E$93),\" \")","v":" "},{"$f":"IF(A15>0,LOOKUP($A15,ANTOINE!$A$22:$A$93,ANTOINE!$F$22:$F$93),\" \")","v":" "},{"$f":"+IF($A15=0,0,POWER(10,$E15-($F15/($B$5+$G15))))","v":0},{"$f":"+IF($B$4>=5,(J15*$B$6)/H15,0)","v":0},0]
[null,null,{"$f":"IF(A16>0,LOOKUP(A16,ANTOINE!A26:A95,ANTOINE!C26:C95),\" \")","v":" "},{"$f":"IF(A16>0,LOOKUP(A16,ANTOINE!$A$22:$A$93,ANTOINE!$B$22:$B$93),\"  \")","v":"  "},{"$f":"IF(A16>0,LOOKUP(A16,ANTOINE!$A$22:$A$93,ANTOINE!$D$22:$D$93),\" \")","v":" "},{"$f":"IF(A16>0,LOOKUP($A16,ANTOINE!$A$22:$A$93,ANTOINE!$E$22:$E$93),\" \")","v":" "},{"$f":"IF(A16>0,LOOKUP($A16,ANTOINE!$A$22:$A$93,ANTOINE!$F$22:$F$93),\" \")","v":" "},{"$f":"+IF($A16=0,0,POWER(10,$E16-($F16/($B$5+$G16))))","v":0},{"$f":"+IF($B$4>=6,(J16*$B$6)/H16,0)","v":0},0]
[null,{"$f":"SUM(B11:B16)","v":0.99999999999999989},null,null,null,null,null,null,{"$f":"SUM(I11:I16)","v":1.0000000000000002},{"$f":"SUM(J11:J16)","v":0.99999999999999989}]
[]
["REFERENCIAS BIBLIOGRÁFICAS:"]
[1,"SMITH, J.M., H.C. VAN NES & M.M. ABBOTT. (2005). Introduction to Chemical Engineering Thermodynamics. Seventh Edition. McGraw Hill. New York."]
[2,"POLING, BRUCE; PRAUSNITZ, JOHN; & O`CONNELL, JOHN. (2001). The Properties of Gases and Liquids. Fifth edition. McGraw Hill. New York."]

{"sheet":"Trocio","index":1,"n_rows":25,"n_cols":11,"rows_kept":25,"cut":false,"hidden":false,"merged":[[5,4,5,10],[23,1,23,10],[24,1,24,10],[12,4,12,6],[0,4,0,10],[2,4,2,10],[3,4,3,10],[4,4,4,10]]}
["TERMODINÁMICA DEL EQUILIBRIO",null,null,null,"PUNTOS DE ROCIO"]
["FEDERICO G. SALAZAR"]
[null,null,null,null,"CALCULO DE Trocio"]
["N",3,"Número de componentes",null,"PROCEDIMIENTO:"]
["P",79.8,"(bar)",null,"1. Seleccione los números de los componentes en la carpeta ANTOINE"]
["T rocio",{"$f":"+H11","v":68.00761818474902},"(ºC)",null,"2. Ingrese los datos requeridos de las casillas en amarillo"]
[null,null,null,null,"3. En el menú HERRAMIENTAS seleccione SOLVER"]
[null,null,null,null,"4. Presione RESOLVER y ACEPTAR"]
[]
[]
[null,null,null,null,null,"SOLVER",{"$f":"1/(K15/POWER(10,$E$15-($F$15/($B$6+$G$15)))+K16/POWER(10,$E$16-($F$16/($B$6+$G$16)))+IF(B4>=3,K17/POWER(10,$E$17-($F$17/($B$6+$G$17))),0)+IF(B4>=4,K18/POWER(10,$E$18-($F$18/($B$6+$G$18))),0)+IF(B4>=5,K19/POWER(10,$E$19-($F$19/($B$6+$G$19))),0)+IF(B4=6,K20/POWER(10,$E$20-($F$20/($B$6+$G$20))),0))","v":79.799999828187651},68.00761818474902,{"$f":"+H15*J15+H16*J16+H17*J17+H18*J18+H19*J19+H20*J20","v":106.36122231997346}]
[]
[" componente",null,null,null,"log10 Pvap  =  A  -  [B / (T °C +  C)] bar",null,null,"(ºC)","(bar)","yi P / Psati","yi = zi"]
["No.","zi","Fórmula","componente","A","B","C","Tsati","Psati  ","xi","yi"]
[1,0.6,{"$f":"LOOKUP(A15,ANTOINE!A22:A93,ANTOINE!C22:C93)","v":"CCl4"},{"$f":"LOOKUP(A15,ANTOINE!$A$22:$A$93,ANTOINE!$B$22:$B$93)","v":"carbon-tetrachloride"},{"$f":"LOOKUP($A15,ANTOINE!$A$22:$A$93,ANTOINE!$D$22:$D$93)","v":6.8940999999999999},{"$f":"LOOKUP($A15,ANTOINE!$A$22:$A$93,ANTOINE!$E$22:$E$93)","v":1219.58},{"$f":"LOOKUP($A15,ANTOINE!$A$22:$A$93,ANTOINE!$F$22:$F$93)","v":227.17},{"$f":"+F15/(E15-LOG10($B$5))-G15","v":17.132138651703059},{"$f":"+IF(A15=0,0,POWER(10,$E15-($F$15/($B$6+$G$15))))","v":578.65295554485681},{"$f":"+K15*$B$5/I15","v":8.2743896045456844E-2},{"$f":"+B15","v":0.6}]
[56,0.3,{"$f":"LOOKUP(A16,ANTOINE!A22:A93,ANTOINE!C22:C93)","v":"C2H3CLO"},{"$f":"LOOKUP(A16,ANTOINE!$A$22:$A$93,ANTOINE!$B$22:$B$93)","v":"acetyl-chloride"},{"$f":"LOOKUP(A16,ANTOINE!$A$22:$A$93,ANTOINE!$D$22:$D$93)","v":6.8407},{"$f":"LOOKUP($A16,ANTOINE!$A$22:$A$93,ANTOINE!$E$22:$E$93)","v":1062.8599999999999},{"$f":"LOOKUP($A16,ANTOINE!$A$22:$A$93,ANTOINE!$F$22:$F$93)","v":217.63},{"$f":"+F16/(E16-LOG10($B$5))-G16","v":-2.4193935146204524},{"$f":"+IF(A16=0,0,POWER(10,$E16-($F16/($B$6+$G16))))","v":1317.320705752187},{"$f":"+K16*$B$5/I16","v":1.8173251126672538E-2},0.3]
[34,0.1,{"$f":"IF(A17>0,LOOKUP(A17,ANTOINE!A23:A94,ANTOINE!C23:C94),\" \")","v":"C2CL6"},{"$f":"IF(A17>0,LOOKUP(A17,ANTOINE!$A$22:$A$93,ANTOINE!$B$22:$B$93),\"  \")","v":"hexachloroethane"},{"$f":"IF(A17>0,LOOKUP(A17,ANTOINE!$A$22:$A$93,ANTOINE!$D$22:$D$93),\" \")","v":7.0863300000000002},{"$f":"IF(A17>0,LOOKUP($A17,ANTOINE!$A$22:$A$93,ANTOINE!$E$22:$E$93),\" \")","v":1626.9449999999999},{"$f":"IF(A17>0,LOOKUP($A17,ANTOINE!$A$22:$A$93,ANTOINE!$F$22:$F$93),\" \")","v":197.048},{"$f":"+IF($B4>=3,F17/(E17-LOG10($B$5))-G17,0)","v":116.77189714454681},{"$f":"+IF($B$4>=3,POWER(10,$E17-($F17/($B$6+$G17))),0)","v":8.8757114606188985},{"$f":"+IF($B$4>=3,K17*$B$5/I17,0)","v":0.89908285498090756},0.1]
[null,null,{"$f":"IF(A18>0,LOOKUP(A18,ANTOINE!A24:A94,ANTOINE!C24:C94),\" \")","v":" "},{"$f":"IF(A18>0,LOOKUP(A18,ANTOINE!$A$22:$A$93,ANTOINE!$B$22:$B$93),\"  \")","v":"  "},{"$f":"IF(A18>0,LOOKUP(A18,ANTOINE!$A$22:$A$93,ANTOINE!$D$22:$D$93),\" \")","v":" "},{"$f":"IF(A18>0,LOOKUP($A18,ANTOINE!$A$22:$A$93,ANTOINE!$E$22:$E$93),\" \")","v":" "},{"$f":"IF(A18>0,LOOKUP($A18,ANTOINE!$A$22:$A$93,ANTOINE!$F$22:$F$93),\" \")","v":" "},{"$f":"+IF($B4>=4,F18/(E18-LOG10($B$5))-G18,0)","v":0},{"$f":"+IF($B$4>=4,POWER(10,$E18-($F18/($B$6+$G18))),0)","v":0},{"$f":"+IF($B$4>=4,K18*$B$5/I18,0)","v":0},0]
[null,null,{"$f":"IF(A19>0,LOOKUP(A19,ANTOINE!A25:A95,ANTOINE!C25:C95),\" \")","v":" "},{"$f":"IF(A19>0,LOOKUP(A19,ANTOINE!$A$22:$A$93,ANTOINE!$B$22:$B$93),\"  \")","v":"  "},{"$f":"IF(A19>0,LOOKUP(A19,ANTOINE!$A$22:$A$93,ANTOINE!$D$22:$D$93),\" \")","v":" "},{"$f":"IF(A19>0,LOOKUP($A19,ANTOINE!$A$22:$A$93,ANTOINE!$E$22:$E$93),\" \")","v":" "},{"$f":"IF(A19>0,LOOKUP($A19,ANTOINE!$A$22:$A$93,ANTOINE!$F$22:$F$93),\" \")","v":" "},{"$f":"+IF($B4>=5,F19/(E19-LOG10($B$5))-G19,0)","v":0},{"$f":"+IF($B$4>=5,POWER(10,$E19-($F19/($B$6+$G19))),0)","v":0},{"$f":"+IF($B$4>=5,K19*$B$5/I19,0)","v":0},0]
[null,null,{"$f":"IF(A20>0,LOOKUP(A20,ANTOINE!A26:A95,ANTOINE!C26:C95),\" \")","v":" "},{"$f":"IF(A20>0,LOOKUP(A20,ANTOINE!$A$22:$A$93,ANTOINE!$B$22:$B$93),\"  \")","v":"  "},{"$f":"IF(A20>0,LOOKUP(A20,ANTOINE!$A$22:$A$93,ANTOINE!$D$22:$D$93),\" \")","v":" "},{"$f":"IF(A20>0,LOOKUP($A20,ANTOINE!$A$22:$A$93,ANTOINE!$E$22:$E$93),\" \")","v":" "},{"$f":"IF(A20>0,LOOKUP($A20,ANTOINE!$A$22:$A$93,ANTOINE!$F$22:$F$93),\" \")","v":" "},{"$f":"+IF($B4=6,F20/(E20-LOG10($B$5))-G20,0)","v":0},{"$f":"+IF($B$4=6,POWER(10,$E20-($F20/($B$6+$G20))),0)","v":0},{"$f":"+IF($B$4>=6,K20*$B$5/I20,0)","v":0},0]
[null,{"$f":"SUM(B15:B20)","v":0.99999999999999989},null,null,null,null,null,null,null,{"$f":"SUM(J15:J20)","v":1.0000000021530369},{"$f":"SUM(K15:K20)","v":0.99999999999999989}]
[]
["REFERENCIAS BIBLIOGRÁFICAS:"]
[1,"SMITH, J.M., H.C. VAN NES & M.M. ABBOTT. (2005). Introduction to Chemical Engineering Thermodynamics. Seventh Edition. McGraw Hill. New York."]
[2,"POLING, BRUCE; PRAUSNITZ, JOHN; & O`CONNELL, JOHN. (2001). The Properties of Gases and Liquids. Fifth edition. McGraw Hill. New York."]

{"sheet":"ANTOINE","index":2,"n_rows":745,"n_cols":6,"rows_kept":745,"cut":false,"hidden":false,"merged":[]}
["CALCULO DE LA PRESION DE VAPOR PARA SUSTANCIAS PURAS"]
["ECUACION DE ANTOINE"]
["REV 18/06/2022"]
[null,null,"log10 Pvap  =  A  -  [B / (T °C +  C)] bar"]
[]
[null,"T =",50,"°C","<---- Ingrese temperatura"]
[null,"No. =",41,null,"<---- Ingrese No. de Sustancia"]
[]
[null,"Sustancia =",{"$f":"LOOKUP($C$7,$A$22:$A$93,$B$22:$B$93)","v":"trichloroethene"},{"$f":"LOOKUP(C7,A22:A93,C22:C93)","v":"C2HCL3"}]
[]
[null,null,"A","B","C"]
[null,"Constantes =",{"$f":"LOOKUP($C$7,$A$22:$A$93,$D$22:$D$93)","v":7.0281000000000002},{"$f":"LOOKUP($C$7,$A$22:$A$93,$E$22:$E$93)","v":1315.1},{"$f":"LOOKUP($C$7,$A$22:$A$93,$F$22:$F$93)","v":230.01}]
[]
[null,"Valor Calculado:","Pvap =",{"$f":"+IF($C$12=0,\"ND\",POWER(10,$C$12-($D$12/($C$6+$E$12))))","v":214.52703089854262},"bar"]
[]
[]
[null,"BASE DE DATOS"]
[null,"Ref:  POLING, BRUCE; PRAUSNITZ, JOHN & O'CONNELL, JOHN."]
[null,"        \"The Properties of Gases and Liquids\". 5th edition.  McGraw Hill.  New York.  2001"]
[]
["No.","SUSTANCIA","FORMULA","A","B","C"]
[1,"carbon-tetrachloride","CCl4",6.8940999999999999,1219.58,227.17]
[2,"trichlorofluoromethane","CCL3F",6.8842999999999996,1043.01,236.86]
[3,"dichlorodifluoromethane","CCL2F2",6.6861899999999999,782.072,235.37700000000001]
[4,"chlorotrifluoromethane","CClF3",6.3510900000000001,522.06100000000004,231.67699999999999]
[5,"carbon-tetrafluoride","CF4",6.9722999999999997,540.5,260.10000000000002]
[6,"carbon-monoxide","CO",6.2401999999999997,230.27,260.01]
[7,"carbon-dioxide","CO2",9.8106000000000009,1347.79,273]
[8,"carbonyl-sulfide","COS",6.9072300000000002,804.48,250]
[9,"carbon-disulfide","CS2",6.9419000000000004,1168.6199999999999,241.54]
[10,"chloroform","CHCl3",6.9371,1171.2,227]
[11,"dichlorofluoromethane","CHCL2F",6.9757499999999997,996.26700000000005,234.172]
[12,"chlorodifluoromethane","CHClF2",6.7576999999999998,740.39,231.86]
[13,"trifluoromethane","CHF3",7.0885999999999996,705.33,249.78]
[14,"triiodomethane","CHI3",6.59598,1567.8,204]
[16,"dichloromethane","CH2Cl2",7.0803000000000003,1138.9100000000001,231.46]
[17,"chlorofluoromethane","CH2CLF",6.2045199999999996,740.39,231.86]
[18,"difluoromethane","CH2F2",7.1388999999999996,821.7,244.7]
[19,"diiodomethane","CH2I2",6.9424599999999996,1567.8,204]
[20,"formaldehyde","CH20",7.1561000000000003,957.24,243.01]
[21,"formic-acid","CH2O2",7.3779000000000003,1563.28,247.07]
[22,"bromomethane","CH3BR",6.9596999999999998,986.59,238.33]
[23,"chloromethane  (Cloruro de metilo)","CH3Cl",6.9943999999999997,902.45,243.61]
[24,"fluoromethane","CH3F",7.0975999999999999,740.22,253.89]
[25,"iodomethane","CH3I",6.9880000000000004,1146.3399999999999,236.66]
[26,"nitromethane","CH3NO2",7.0439999999999996,1291,209.01]
[28,"Etilbenceno","C8H10",6.8257199709892227,1417.6348514178712,213.72941796115342]
[29,"methane","CH4",6.6956100000000003,405.42,267.77699999999999]
[30,"methanol","CH4O",8.0724,1574.99,238.87]
[31,"methanethiol","CH4S",7.0316299999999998,1015.547,238.70599999999999]
[32,"methylamine","CH5N",7.4969000000000001,1079.1500000000001,240.24]
[33,"tetrachloroethene","C2CL4",7.02,1415.49,221.01]
[34,"hexachloroethane","C2CL6",7.0863300000000002,1626.9449999999999,197.048]
[35,"112trichlorotrifluoroethane","C2CL3F3",6.8803000000000001,1099.9000000000001,227.5]
[36,"12dichlorotetrafluoroethane","C2CL2F4",6.8708400000000003,942.33600000000001,232.63200000000001]
[37,"chloropentafluoroethane","C2CLF5",6.8333000000000004,802.97,242.28]
[38,"tetrafluoroethene","C2F4",6.8966000000000003,683.84,245.94]
[38,"Acetato de Metilo","C3H6O2",7.0230120851481947,1157.9532489212011,221.16917490290058]
[39,"hexafluoroethane","C2F6",6.7933000000000003,657.06,246.22]
[40,"cyanogen","C2N2",6.4362899999999996,576.57899999999995,182.30799999999999]
[41,"trichloroethene","C2HCL3",7.0281000000000002,1315.1,230.01]
[42,"pentachloroethane","C2HCL5",6.74,1378,197]
[43,"trifluoroethene","C2HF3",5.6871499999999999,491.35899999999998,227.23]
[44,"acetylene (ethyne)","C2H2",9.1402000000000001,1232.5999999999999,280.89999999999998]
[45,"1,1-dichloroethene","C2H2CL2",6.9722,1099.4000000000001,237.2]
[46,"cis-1,2-dichloroethene","C2H2CL2",7.0223000000000004,1205.4000000000001,230.6]
[46,"1-Propanol","C3H8O",4.9999099999999999,1512.94,205.80699999999999]
[47,"trans-1,2-dichloroethene","C2H2CL2",6.9650999999999996,1141.9000000000001,231.9]
[48,"1,1,2,2-tetrachloroethane","C2H2CL4",6.6317000000000004,1228.0999999999999,179.9]
[49,"1,1-difluoroethene","C2H2F2",6.3491799999999996,491.35899999999998,227.239]
[49,"2-Propanol","C3H8O",5.24268,1580.92,219.61]
[50,"cis-1,2-difluoroethene","C2H2F2",5.3140099999999997,491.35899999999998,227.23]
[51,"trans-1,2-difluoroethene","C2H2F2",5.3140099999999997,491.35899999999998,227.23]
[52,"ketene","C2H2O",6.9573,803.1,238.01]
[53,"bromoethylene","C2H3BR",7.2437899999999997,1219.308,264.02100000000002]
[54,"chloroethene","C2H3CL",6.4970999999999997,783.4,230.01]
[55,"1,1,2-trichloroethane","C2H3CL3",6.9653,1351,217]
[56,"acetyl-chloride","C2H3CLO",6.8407,1062.8599999999999,217.63]
[57,"fluoroethene","C2H3F",6.3394899999999996,593.55100000000004,243.11099999999999]
[58,"1,1,1-trifluoroethane","C2H3F3",6.9038000000000004,788.21,243.24]
[59,"acetonitrile","C2H3N",7.0735000000000001,1279.2,224.01]
[60,"ethylene","C2H4",6.74756,585,255]
[61,"1,2-dibromoethane","C2H4BR2",6.7214799999999997,1280.82,201.75]
[62,"1,1-dichloroethane","C2H4CL2",6.9852999999999996,1171.42,228.13]
[63,"1,2-dichloroethane","C2H4CL2",7.0252999999999997,1271.25,222.94]
[64,"1,1-difluoroethane","C2H4F2",7.03,910,244]
[65,"1,2-diiodoethane","C2H4I2",6.98834,1647.1,201]
[66,"ethylene-oxide","C2H4O",7.2701000000000002,1115.0999999999999,244.15]
[67,"acetaldehyde","C2H40",7.0564999999999998,1070.5999999999999,236.01]
[68,"acetic-acid","C2H4O2",7.2995999999999999,1479.02,216.82]
[69,"methyl-formate","C2H4O2",7.1703999999999999,1125.2,230.56]
[70,"thioacetic-acid","C2H4OS",7.7488900000000003,1479.02,216.82]
[71,"thiacyclopropane","C2H4S",7.0372500000000002,1194.3699999999999,232.42]
[72,"bromoethane","C2H5BR",6.92,1090.81,231.72]
[73,"chloroethane (Cloruro de etilo)","C2H5Cl",6.94,1012.78,236.68]
[74,"fluoroethane","C2H5F",6.9785000000000004,854.21,246.16]
[75,"iodoethane","C2H5I",6.9589999999999996,1232,229]
[76,"ethylenimine","C2H5N",7.1322999999999999,1133.7,210.01]
[77,"nitroethane","C2H5NO2",7.5877699999999999,1671.2660000000001,241.18700000000001]
[78,"ethyl-nitrate","C2H5NO3",7.1637000000000004,1338.8,224.9]
[79,"ethane","C2H6",6.8345200000000004,663.7,256.47000000000003]
[80,"methyl-ether","C2H6O",7.3163999999999998,1025.56,256.06]
[81,"ethyl-alcohol (ethanol)","C2H6O",8.2133000000000003,1652.05,231.48]
[82,"ethylene-glycol","C2H6O2",8.7944999999999993,2615.4,244.91]
[83,"methyl-sulfide","C2H6S",6.9487899999999998,1090.7550000000001,230.79900000000001]
[84,"ethanethiol","C2H6S",6.9520600000000004,1084.5309999999999,231.38499999999999]
[85,"methyl-disulfide","C2H6S2",6.9779200000000001,1346.3420000000001,218.863]
[86,"ethylamine","C2H7N",7.3861999999999997,1137.3,235.86]
[87,"dimethylamine","C2H7N",7.0639000000000003,1024.4000000000001,238.01]
[88,"acrylonitrile","C3H3N",6.9162999999999997,1208.3,222.01]
[89,"allene(propadiene)","C3H4",5.7137000000000002,458.06,196.07]
[90,"propyne(methylacetylene)","C3H4",6.7848499999999996,803.73,229.08]
[91,"acrylic-acid","C3H4O2",7.1925999999999997,1441.5,193.01]
[92,"3-bromo-1-propene","C3H5BR",7.0518700000000001,1259.83,232.04]
[93,"3-chloro-1-propene","C3H5CL",6.9387999999999996,1099.5999999999999,226.01]
[94,"1,2,3-trichloropropane","C3H5CL3",7.0027999999999997,1484.1,204.01]
[95,"3-iodo-1-propene","C3H5I",6.9692999999999996,1316.5,220]
[96,"propionitrile","C3H5N",6.9301000000000004,1277.2,218.01]
[97,"propene  (Propileno)","C3H6",6.8196000000000003,785,247]
[98,"cyclopropane","C3H6",6.8879000000000001,856.01,246.51]
[99,"1,2-dibromopropane","C3H6BR2",6.8910499999999999,1419.6,212]
[100,"1,2-dichloropropane","C3H6CL2",6.9653999999999998,1296.4000000000001,221]
[101,"1,3-dichloropropane","C3H6CL2",6.9718600000000004,1376.2,216]
[102,"2,2-dichloropropane","C3H6CL2",6.9481999999999999,1201.0999999999999,226]
[103,"1,2-diiodopropane","C3H6I2",6.0765000000000002,1507.41,244.7]
[104,"propylene-oxide","C3H6O",6.6546000000000003,915.31,208.29]
[105,"allyl-alcohol","C3H6O",7.3423999999999996,1271.7,188.01]
[106,"propionaldehyde","C3H6O",7.0492999999999997,1154.8,229.01]
[107,"acetone","C3H6O",7.2316000000000003,1277.03,237.23]
[108,"thiacyclobutane","C3H6S",7.0166700000000004,1321.3309999999999,224.51300000000001]
[109,"1-bromopropane","C3H7BR",7.0376599999999998,1259.836,232.042]
[110,"2-bromopropane","C3H7BR",7.0046299999999997,1223.4749999999999,236.50800000000001]
[111,"1-chloropropane","C3H7CL",6.9310999999999998,1121.1199999999999,230.21]
[112,"2-chloropropane","C3H7CL",6.9653999999999998,1081.5999999999999,230.01]
[113,"1-fluoropropane","C3H7F",6.9532999999999996,965.18,239.5]
[114,"2-fluoropropane","C3H7F",7.0745100000000001,965.18,239.5]
[115,"1-iodopropane","C3H7I",7.2212100000000001,1507.41,244.70099999999999]
[116,"2-iodopropane","C3H7I",7.0167000000000002,1340.4480000000001,234.36500000000001]
[117,"1-nitropropane","C3H7NO2",7.1146000000000003,1467.45,215.23]
[118,"2-nitropropane","C3H7NO2",7.4865399999999998,1664.0360000000001,240.995]
[119,"propyl-nitrate","C3H7NO3",7.73719,1721.723,245.49]
[120,"isopropyl-nitrate","C3H7NO3",6.4200600000000003,1018.568,183.52799999999999]
[121,"propane","C3H8",6.8039800000000001,803.81,246.99]
[122,"ethyl-methyl-ether","C3H8O",5.8818999999999999,504.49,160.76]
[123,"propyl-alcohol","C3H8O",7.6192000000000002,1375.14,193.01]
[124,"isopropyl-alcohol","C3H8O",8.1181999999999999,1580.92,219.62]
[125,"ethyl-methyl-sulfide","C3H8S",6.9384899999999998,1182.5619999999999,224.78399999999999]
[126,"1-propanethiol","C3H8S",6.9284600000000003,1183.307,224.624]
[127,"2-propanethiol","C3H8S",6.8773400000000002,1113.895,226.15700000000001]
[128,"propylamine","C3H9N",6.9467999999999996,1108.2,224.01]
[129,"trimethylamine","C3H9N",6.9703999999999997,968.7,234.01]
[130,"octafluorocyclobutane","C4F8",6.8152999999999997,862.49,225.15]
[131,"butadiyne(biacetylene)","C4H2",5.5191699999999999,460.68400000000003,164.59399999999999]
[132,"1buten3yne(vinylacetylene)","C4H4",6.9530000000000003,957,230.01]
[133,"furan","C4H4O",6.9752999999999998,1060.8499999999999,227.75]
[134,"thiophene","C4H4S",6.9592599999999996,1246.02,221.35]
[135,"1,2-butadiene","C4H6",6.99383,1041.117,242.274]
[136,"1,3-butadiene","C4H6",6.84999,930.54600000000005,238.85400000000001]
[137,"1-butyne(ethylacetylene)","C4H6",6.9819800000000001,988.75,233.01]
[138,"2-butyne(dimethylacetylene)","C4H6",7.0733800000000002,1101.71,235.81]
[139,"cyclobutene","C4H6",6.9576900000000004,1009.32,244.98599999999999]
[140,"acetic-anhydride","C4H6O3",7.1215999999999999,1427.77,198.05]
[141,"butyronitrile","C4H7N",7.0396000000000001,1390.7,217]
[142,"isobutyronitrile","C4H7N",7.21591,1390.7,217]
[143,"1-butene","C4H8",6.8429000000000002,926.1,240]
[144,"2-butene,cis","C4H8",6.8692599999999997,960.1,237]
[145,"2-butene,trans","C4H8",6.8695199999999996,960.8,240]
[146,"2-methylpropene  (Isobutileno)","C4H8",6.8413399999999998,923.2,240]
[147,"cyclobutane","C4H8",6.9162999999999997,1024.54,241.38]
[148,"1,2-dibromobutane","C4H8BR2",7.2569600000000003,1759.076,235.00899999999999]
[149,"2,3-dibromobutane","C4H8BR2",7.2002300000000004,1691.481,230.22300000000001]
[150,"1,2-diiodobutane","C4H8I2",6.2432999999999996,1507.41,244.7]
[151,"butyraldehyde","C4H8O",7.0212000000000003,1233,223.01]
[152,"2-butanone  (Metil Etil Cetona)","C4H8O ",7.2087000000000003,1368.21,236.51]
[153,"p-dioxane","C4H8O2",7.0063000000000004,1288.5,211.01]
[154,"ethyl-acetate","C4H8O2",7.0145999999999997,1211.9000000000001,216.01]
[155,"thiacyclopentane","C4H8S",6.9954000000000001,1401.9390000000001,219.607]
[156,"1-bromobutane","C4H9BR",6.9225399999999997,1298.6079999999999,219.7]
[157,"2-bromobutane","C4H9BR",6.8272399999999998,1229.08,220]
[158,"2-bromo-2-methylpropane","C4H9BR",6.6684999999999999,1129.7,225]
[159,"1-chlorobutane","C4H9CL",6.9379,1227.43,224.11]
[160,"2-chlorobutane","C4H9CL",6.9447000000000001,1195.8,226.01]
[161,"1-chloro-2-methylpropane","C4H9CL",6.9530399999999997,1205.079,227.04599999999999]
[162,"2-chloro-2-methylpropane","C4H9CL",6.8670999999999998,1114.9000000000001,229.01]
[163,"2-iodo-2-methylpropane","C4H9I",7.2538999999999998,1507.41,244.7]
[164,"pyrrolidine","C4H9N",6.9245999999999999,1179.99,205.26]
[165,"1-nitrobutane","C4H9NO2",6.8671499999999996,1467.45,215.23]
[166,"2-nitrobutane","C4H9NO2",7.25197,1664.03,240.99]
[167,"butane  (n-butano)","C4H10",6.8089599999999999,935.86,238.73]
[168,"2-methylpropane (isobutane)","C4H10",6.9104799999999997,946.35,246.68]
[169,"ethyl-ether (Eter dietílico)","C4H10O",6.9203200000000002,1064.07,228.8]
[170,"methyl-propyl-ether","C4H10O",6.1185999999999998,708.69,179.9]
[171,"methyl-isopropyl-ether","C4H10O",6.2449500000000002,708.69,179.9]
[172,"butyl-alcohol  (1-Butanol)","C4H10O",7.4767999999999999,1362.39,178.73]
[173,"sec-butyl-alcohol","C4H10O",7.4743000000000004,1314.19,186.51]
[174,"tert-butyl-alcohol","C4H10O",7.3198999999999996,1154.48,177.66]
[175,"ethylsulfide","C4H10S",6.9283599999999996,1257.8330000000001,218.66200000000001]
[176,"isopropyl-methyl-sulfide","C4H10S",6.9019599999999999,1232.17,221.67]
[177,"methyl-propyl-sulfide","C4H10S",6.9554499999999999,1284.32,219.66]
[178,"1-butanethiol","C4H10S",6.9275399999999996,1281.018,218.1]
{"$rows_left_out":545}