{"text_format":"1","workbook":"xlsx","n_sheets":3,"sheets":["Procio","Trocio","ANTOINE"],"not_rendered":{"charts":0,"images":1,"macros":1,"external_links":0,"defined_names":54,"comments":0,"pivot_tables":0},"unopened":[],"bounds":{"document_bytes":16777216,"sheet_cells":100000,"rows_first":2000,"rows_last":500,"rows_between":2000,"halvings":0,"cell_chars":16384,"cell_head_chars":4096},"cells_cut":0,"cells_raw":0,"read":"whole","date_system":"1900"}

{"sheet":"Procio","index":0,"n_rows":21,"n_cols":10,"rows_kept":21,"cut":false,"hidden":false,"merged":[[20,1,20,9],[8,4,8,6],[0,4,0,9],[2,4,2,9],[3,4,3,9],[4,4,4,9],[5,4,5,9],[19,1,19,9]]}
["TERMODINÁMICA DEL EQUILIBRIO",null,null,null,"PUNTOS DE ROCIO"]
["FEDERICO G. SALAZAR"]
[null,null,null,null,"CALCULO DE Procio"]
["N",3,"Número de componentes",null,"PROCEDIMIENTO:"]
["T ",68,"(ºC)",null,"1. Seleccione los números de los componentes en la carpeta ANTOINE"]
["P rocio",{"$f":"1/(B11/H11+B12/H12+IF(B4>=3,B13/H13,0)+IF(B4>=4,B14/H14)+IF(B4>=5,B15/H15)+IF(B4=6,B16/H16))","v":79.768906949617303},"(bar)",null,"2. Ingrese los datos requeridos de las casillas en amarillo"]
[]
[]
[" componente",null,null,null,"log10 Pvap  =  A  -  [B / (T °C +  C)] bar",null,null,"(kPa)","yi P / Psati","yi = zi"]
["No.","zi","Fórmula","componente","A","B","C","Psati  ","xi","yi"]
[1,0.6,{"$f":"LOOKUP(A11,ANTOINE!A22:A93,ANTOINE!C22:C93)","v":"CCl4"},{"$f":"LOOKUP(A11,ANTOINE!$A$22:$A$93,ANTOINE!$B$22:$B$93)","v":"carbon-tetrachloride"},{"$f":"LOOKUP($A11,ANTOINE!$A$22:$A$93,ANTOINE!$D$22:$D$93)","v":6.8940999999999999},{"$f":"LOOKUP($A11,ANTOINE!$A$22:$A$93,ANTOINE!$E$22:$E$93)","v":1219.58},{"$f":"LOOKUP($A11,ANTOINE!$A$22:$A$93,ANTOINE!$F$22:$F$93)","v":227.17},{"$f":"+IF($E$11=0,0,POWER(10,$E$11-($F$11/($B$5+$G$11))))","v":578.51089067359726},{"$f":"+(J11*$B$6)/H11","v":8.2731967438058704E-2},{"$f":"+B11","v":0.6}]
[56,0.3,{"$f":"LOOKUP(A12,ANTOINE!A22:A93,ANTOINE!C22:C93)","v":"C2H3CLO"},{"$f":"LOOKUP(A12,ANTOINE!$A$22:$A$93,ANTOINE!$B$22:$B$93)","v":"acetyl-chloride"},{"$f":"LOOKUP(A12,ANTOINE!$A$22:$A$93,ANTOINE!$D$22:$D$93)","v":6.8407},{"$f":"LOOKUP($A12,ANTOINE!$A$22:$A$93,ANTOINE!$E$22:$E$93)","v":1062.8599999999999},{"$f":"LOOKUP($A12,ANTOINE!$A$22:$A$93,ANTOINE!$F$22:$F$93)","v":217.63},{"$f":"+IF($E12=0,0,POWER(10,$E12-($F12/($B$5+$G12))))","v":1317.0197061469714},{"$f":"+(J12*$B$6)/H12","v":1.817032195736536E-2},0.3]
[34,0.1,{"$f":"IF(A13>0,LOOKUP(A13,ANTOINE!A23:A94,ANTOINE!C23:C94),\" \")","v":"C2CL6"},{"$f":"IF(A13>0,LOOKUP(A13,ANTOINE!$A$22:$A$93,ANTOINE!$B$22:$B$93),\"  \")","v":"hexachloroethane"},{"$f":"IF(A13>0,LOOKUP(A13,ANTOINE!$A$22:$A$93,ANTOINE!$D$22:$D$93),\" \")","v":7.0863300000000002},{"$f":"IF(A13>0,LOOKUP($A13,ANTOINE!$A$22:$A$93,ANTOINE!$E$22:$E$93),\" \")","v":1626.9449999999999},{"$f":"IF(A13>0,LOOKUP($A13,ANTOINE!$A$22:$A$93,ANTOINE!$F$22:$F$93),\" \")","v":197.048},{"$f":"+IF(A13=0,0,POWER(10,$E13-($F13/($B$5+$G13))))","v":8.8721065584716783},{"$f":"+IF($B$4>=3,(J13*$B$6)/H13,0)","v":0.89909771060457611},0.1]
[null,null,{"$f":"IF(A14>0,LOOKUP(A14,ANTOINE!A24:A94,ANTOINE!C24:C94),\" \")","v":" "},{"$f":"IF(A14>0,LOOKUP(A14,ANTOINE!$A$22:$A$93,ANTOINE!$B$22:$B$93),\"  \")","v":"  "},{"$f":"IF(A14>0,LOOKUP(A14,ANTOINE!$A$22:$A$93,ANTOINE!$D$22:$D$93),\" \")","v":" "},{"$f":"IF(A14>0,LOOKUP($A14,ANTOINE!$A$22:$A$93,ANTOINE!$E$22:$E$93),\" \")","v":" "},{"$f":"IF(A14>0,LOOKUP($A14,ANTOINE!$A$22:$A$93,ANTOINE!$F$22:$F$93),\" \")","v":" "},{"$f":"+IF($A14=0,0,POWER(10,$E14-($F14/($B$5+$G14))))","v":0},{"$f":"+IF($B$4>=4,(J14*$B$6)/H14,0)","v":0},0]
[null,null,{"$f":"IF(A15>0,LOOKUP(A15,ANTOINE!A25:A95,ANTOINE!C25:C95),\" \")","v":" "},{"$f":"IF(A15>0,LOOKUP(A15,ANTOINE!$A$22:$A$93,ANTOINE!$B$22:$B$93),\"  \")","v":"  "},{"$f":"IF(A15>0,LOOKUP(A15,ANTOINE!$A$22:$A$93,ANTOINE!$D$22:$D$93),\" \")","v":" "},{"$f":"IF(A15>0,LOOKUP($A15,ANTOINE!$A$22:$A$93,ANTOINE!$E$22:$E$93),\" \")","v":" "},{"$f":"IF(A15>0,LOOKUP($A15,ANTOINE!$A$22:$A$93,ANTOINE!$F$22:$F$93),\" \")","v":" "},{"$f":"+IF($A15=0,0,POWER(10,$E15-($F15/($B$5+$G15))))","v":0},{"$f":"+IF($B$4>=5,(J15*$B$6)/H15,0)","v":0},0]
[null,null,{"$f":"IF(A16>0,LOOKUP(A16,ANTOINE!A26:A95,ANTOINE!C26:C95),\" \")","v":" "},{"$f":"IF(A16>0,LOOKUP(A16,ANTOINE!$A$22:$A$93,ANTOINE!$B$22:$B$93),\"  \")","v":"  "},{"$f":"IF(A16>0,LOOKUP(A16,ANTOINE!$A$22:$A$93,ANTOINE!$D$22:$D$93),\" \")","v":" "},{"$f":"IF(A16>0,LOOKUP($A16,ANTOINE!$A$22:$A$93,ANTOINE!$E$22:$E$93),\" \")","v":" "},{"$f":"IF(A16>0,LOOKUP($A16,ANTOINE!$A$22:$A$93,ANTOINE!$F$22:$F$93),\" \")","v":" "},{"$f":"+IF($A16=0,0,POWER(10,$E16-($F16/($B$5+$G16))))","v":0},{"$f":"+IF($B$4>=6,(J16*$B$6)/H16,0)","v":0},0]
[null,{"$f":"SUM(B11:B16)","v":0.99999999999999989},null,null,null,null,null,null,{"$f":"SUM(I11:I16)","v":1.0000000000000002},{"$f":"SUM(J11:J16)","v":0.99999999999999989}]
[]
["REFERENCIAS BIBLIOGRÁFICAS:"]
[1,"SMITH, J.M., H.C. VAN NES & M.M. ABBOTT. (2005). Introduction to Chemical Engineering Thermodynamics. Seventh Edition. McGraw Hill. New York."]
[2,"POLING, BRUCE; PRAUSNITZ, JOHN; & O`CONNELL, JOHN. (2001). The Properties of Gases and Liquids. Fifth edition. McGraw Hill. New York."]

{"sheet":"Trocio","index":1,"n_rows":25,"n_cols":11,"rows_kept":25,"cut":false,"hidden":false,"merged":[[5,4,5,10],[23,1,23,10],[24,1,24,10],[12,4,12,6],[0,4,0,10],[2,4,2,10],[3,4,3,10],[4,4,4,10]]}
["TERMODINÁMICA DEL EQUILIBRIO",null,null,null,"PUNTOS DE ROCIO"]
["FEDERICO G. SALAZAR"]
[null,null,null,null,"CALCULO DE Trocio"]
["N",3,"Número de componentes",null,"PROCEDIMIENTO:"]
["P",79.8,"(bar)",null,"1. Seleccione los números de los componentes en la carpeta ANTOINE"]
["T rocio",{"$f":"+H11","v":68.00761818474902},"(ºC)",null,"2. Ingrese los datos requeridos de las casillas en amarillo"]
[null,null,null,null,"3. En el menú HERRAMIENTAS seleccione SOLVER"]
[null,null,null,null,"4. Presione RESOLVER y ACEPTAR"]
[]
[]
[null,null,null,null,null,"SOLVER",{"$f":"1/(K15/POWER(10,$E$15-($F$15/($B$6+$G$15)))+K16/POWER(10,$E$16-($F$16/($B$6+$G$16)))+IF(B4>=3,K17/POWER(10,$E$17-($F$17/($B$6+$G$17))),0)+IF(B4>=4,K18/POWER(10,$E$18-($F$18/($B$6+$G$18))),0)+IF(B4>=5,K19/POWER(10,$E$19-($F$19/($B$6+$G$19))),0)+IF(B4=6,K20/POWER(10,$E$20-($F$20/($B$6+$G$20))),0))","v":79.799999828187651},68.00761818474902,{"$f":"+H15*J15+H16*J16+H17*J17+H18*J18+H19*J19+H20*J20","v":106.36122231997346}]
[]
[" componente",null,null,null,"log10 Pvap  =  A  -  [B / (T °C +  C)] bar",null,null,"(ºC)","(bar)","yi P / Psati","yi = zi"]
["No.","zi","Fórmula","componente","A","B","C","Tsati","Psati  ","xi","yi"]
[1,0.6,{"$f":"LOOKUP(A15,ANTOINE!A22:A93,ANTOINE!C22:C93)","v":"CCl4"},{"$f":"LOOKUP(A15,ANTOINE!$A$22:$A$93,ANTOINE!$B$22:$B$93)","v":"carbon-tetrachloride"},{"$f":"LOOKUP($A15,ANTOINE!$A$22:$A$93,ANTOINE!$D$22:$D$93)","v":6.8940999999999999},{"$f":"LOOKUP($A15,ANTOINE!$A$22:$A$93,ANTOINE!$E$22:$E$93)","v":1219.58},{"$f":"LOOKUP($A15,ANTOINE!$A$22:$A$93,ANTOINE!$F$22:$F$93)","v":227.17},{"$f":"+F15/(E15-LOG10($B$5))-G15","v":17.132138651703059},{"$f":"+IF(A15=0,0,POWER(10,$E15-($F$15/($B$6+$G$15))))","v":578.65295554485681},{"$f":"+K15*$B$5/I15","v":8.2743896045456844E-2},{"$f":"+B15","v":0.6}]
[56,0.3,{"$f":"LOOKUP(A16,ANTOINE!A22:A93,ANTOINE!C22:C93)","v":"C2H3CLO"},{"$f":"LOOKUP(A16,ANTOINE!$A$22:$A$93,ANTOINE!$B$22:$B$93)","v":"acetyl-chloride"},{"$f":"LOOKUP(A16,ANTOINE!$A$22:$A$93,ANTOINE!$D$22:$D$93)","v":6.8407},{"$f":"LOOKUP($A16,ANTOINE!$A$22:$A$93,ANTOINE!$E$22:$E$93)","v":1062.8599999999999},{"$f":"LOOKUP($A16,ANTOINE!$A$22:$A$93,ANTOINE!$F$22:$F$93)","v":217.63},{"$f":"+F16/(E16-LOG10($B$5))-G16","v":-2.4193935146204524},{"$f":"+IF(A16=0,0,POWER(10,$E16-($F16/($B$6+$G16))))","v":1317.320705752187},{"$f":"+K16*$B$5/I16","v":1.8173251126672538E-2},0.3]
[34,0.1,{"$f":"IF(A17>0,LOOKUP(A17,ANTOINE!A23:A94,ANTOINE!C23:C94),\" \")","v":"C2CL6"},{"$f":"IF(A17>0,LOOKUP(A17,ANTOINE!$A$22:$A$93,ANTOINE!$B$22:$B$93),\"  \")","v":"hexachloroethane"},{"$f":"IF(A17>0,LOOKUP(A17,ANTOINE!$A$22:$A$93,ANTOINE!$D$22:$D$93),\" \")","v":7.0863300000000002},{"$f":"IF(A17>0,LOOKUP($A17,ANTOINE!$A$22:$A$93,ANTOINE!$E$22:$E$93),\" \")","v":1626.9449999999999},{"$f":"IF(A17>0,LOOKUP($A17,ANTOINE!$A$22:$A$93,ANTOINE!$F$22:$F$93),\" \")","v":197.048},{"$f":"+IF($B4>=3,F17/(E17-LOG10($B$5))-G17,0)","v":116.77189714454681},{"$f":"+IF($B$4>=3,POWER(10,$E17-($F17/($B$6+$G17))),0)","v":8.8757114606188985},{"$f":"+IF($B$4>=3,K17*$B$5/I17,0)","v":0.89908285498090756},0.1]
[null,null,{"$f":"IF(A18>0,LOOKUP(A18,ANTOINE!A24:A94,ANTOINE!C24:C94),\" \")","v":" "},{"$f":"IF(A18>0,LOOKUP(A18,ANTOINE!$A$22:$A$93,ANTOINE!$B$22:$B$93),\"  \")","v":"  "},{"$f":"IF(A18>0,LOOKUP(A18,ANTOINE!$A$22:$A$93,ANTOINE!$D$22:$D$93),\" \")","v":" "},{"$f":"IF(A18>0,LOOKUP($A18,ANTOINE!$A$22:$A$93,ANTOINE!$E$22:$E$93),\" \")","v":" "},{"$f":"IF(A18>0,LOOKUP($A18,ANTOINE!$A$22:$A$93,ANTOINE!$F$22:$F$93),\" \")","v":" "},{"$f":"+IF($B4>=4,F18/(E18-LOG10($B$5))-G18,0)","v":0},{"$f":"+IF($B$4>=4,POWER(10,$E18-($F18/($B$6+$G18))),0)","v":0},{"$f":"+IF($B$4>=4,K18*$B$5/I18,0)","v":0},0]
[null,null,{"$f":"IF(A19>0,LOOKUP(A19,ANTOINE!A25:A95,ANTOINE!C25:C95),\" \")","v":" "},{"$f":"IF(A19>0,LOOKUP(A19,ANTOINE!$A$22:$A$93,ANTOINE!$B$22:$B$93),\"  \")","v":"  "},{"$f":"IF(A19>0,LOOKUP(A19,ANTOINE!$A$22:$A$93,ANTOINE!$D$22:$D$93),\" \")","v":" "},{"$f":"IF(A19>0,LOOKUP($A19,ANTOINE!$A$22:$A$93,ANTOINE!$E$22:$E$93),\" \")","v":" "},{"$f":"IF(A19>0,LOOKUP($A19,ANTOINE!$A$22:$A$93,ANTOINE!$F$22:$F$93),\" \")","v":" "},{"$f":"+IF($B4>=5,F19/(E19-LOG10($B$5))-G19,0)","v":0},{"$f":"+IF($B$4>=5,POWER(10,$E19-($F19/($B$6+$G19))),0)","v":0},{"$f":"+IF($B$4>=5,K19*$B$5/I19,0)","v":0},0]
[null,null,{"$f":"IF(A20>0,LOOKUP(A20,ANTOINE!A26:A95,ANTOINE!C26:C95),\" \")","v":" "},{"$f":"IF(A20>0,LOOKUP(A20,ANTOINE!$A$22:$A$93,ANTOINE!$B$22:$B$93),\"  \")","v":"  "},{"$f":"IF(A20>0,LOOKUP(A20,ANTOINE!$A$22:$A$93,ANTOINE!$D$22:$D$93),\" \")","v":" "},{"$f":"IF(A20>0,LOOKUP($A20,ANTOINE!$A$22:$A$93,ANTOINE!$E$22:$E$93),\" \")","v":" "},{"$f":"IF(A20>0,LOOKUP($A20,ANTOINE!$A$22:$A$93,ANTOINE!$F$22:$F$93),\" \")","v":" "},{"$f":"+IF($B4=6,F20/(E20-LOG10($B$5))-G20,0)","v":0},{"$f":"+IF($B$4=6,POWER(10,$E20-($F20/($B$6+$G20))),0)","v":0},{"$f":"+IF($B$4>=6,K20*$B$5/I20,0)","v":0},0]
[null,{"$f":"SUM(B15:B20)","v":0.99999999999999989},null,null,null,null,null,null,null,{"$f":"SUM(J15:J20)","v":1.0000000021530369},{"$f":"SUM(K15:K20)","v":0.99999999999999989}]
[]
["REFERENCIAS BIBLIOGRÁFICAS:"]
[1,"SMITH, J.M., H.C. VAN NES & M.M. ABBOTT. (2005). Introduction to Chemical Engineering Thermodynamics. Seventh Edition. McGraw Hill. New York."]
[2,"POLING, BRUCE; PRAUSNITZ, JOHN; & O`CONNELL, JOHN. (2001). The Properties of Gases and Liquids. Fifth edition. McGraw Hill. New York."]

{"sheet":"ANTOINE","index":2,"n_rows":745,"n_cols":6,"rows_kept":745,"cut":false,"hidden":false,"merged":[]}
["CALCULO DE LA PRESION DE VAPOR PARA SUSTANCIAS PURAS"]
["ECUACION DE ANTOINE"]
["REV 18/06/2022"]
[null,null,"log10 Pvap  =  A  -  [B / (T °C +  C)] bar"]
[]
[null,"T =",50,"°C","<---- Ingrese temperatura"]
[null,"No. =",41,null,"<---- Ingrese No. de Sustancia"]
[]
[null,"Sustancia =",{"$f":"LOOKUP($C$7,$A$22:$A$93,$B$22:$B$93)","v":"trichloroethene"},{"$f":"LOOKUP(C7,A22:A93,C22:C93)","v":"C2HCL3"}]
[]
[null,null,"A","B","C"]
[null,"Constantes =",{"$f":"LOOKUP($C$7,$A$22:$A$93,$D$22:$D$93)","v":7.0281000000000002},{"$f":"LOOKUP($C$7,$A$22:$A$93,$E$22:$E$93)","v":1315.1},{"$f":"LOOKUP($C$7,$A$22:$A$93,$F$22:$F$93)","v":230.01}]
[]
[null,"Valor Calculado:","Pvap =",{"$f":"+IF($C$12=0,\"ND\",POWER(10,$C$12-($D$12/($C$6+$E$12))))","v":214.52703089854262},"bar"]
[]
[]
[null,"BASE DE DATOS"]
[null,"Ref:  POLING, BRUCE; PRAUSNITZ, JOHN & O'CONNELL, JOHN."]
[null,"        \"The Properties of Gases and Liquids\". 5th edition.  McGraw Hill.  New York.  2001"]
[]
["No.","SUSTANCIA","FORMULA","A","B","C"]
[1,"carbon-tetrachloride","CCl4",6.8940999999999999,1219.58,227.17]
[2,"trichlorofluoromethane","CCL3F",6.8842999999999996,1043.01,236.86]
[3,"dichlorodifluoromethane","CCL2F2",6.6861899999999999,782.072,235.37700000000001]
[4,"chlorotrifluoromethane","CClF3",6.3510900000000001,522.06100000000004,231.67699999999999]
[5,"carbon-tetrafluoride","CF4",6.9722999999999997,540.5,260.10000000000002]
[6,"carbon-monoxide","CO",6.2401999999999997,230.27,260.01]
[7,"carbon-dioxide","CO2",9.8106000000000009,1347.79,273]
[8,"carbonyl-sulfide","COS",6.9072300000000002,804.48,250]
[9,"carbon-disulfide","CS2",6.9419000000000004,1168.6199999999999,241.54]
[10,"chloroform","CHCl3",6.9371,1171.2,227]
[11,"dichlorofluoromethane","CHCL2F",6.9757499999999997,996.26700000000005,234.172]
[12,"chlorodifluoromethane","CHClF2",6.7576999999999998,740.39,231.86]
[13,"trifluoromethane","CHF3",7.0885999999999996,705.33,249.78]
[14,"triiodomethane","CHI3",6.59598,1567.8,204]
[16,"dichloromethane","CH2Cl2",7.0803000000000003,1138.9100000000001,231.46]
[17,"chlorofluoromethane","CH2CLF",6.2045199999999996,740.39,231.86]
[18,"difluoromethane","CH2F2",7.1388999999999996,821.7,244.7]
[19,"diiodomethane","CH2I2",6.9424599999999996,1567.8,204]
[20,"formaldehyde","CH20",7.1561000000000003,957.24,243.01]
[21,"formic-acid","CH2O2",7.3779000000000003,1563.28,247.07]
[22,"bromomethane","CH3BR",6.9596999999999998,986.59,238.33]
[23,"chloromethane  (Cloruro de metilo)","CH3Cl",6.9943999999999997,902.45,243.61]
[24,"fluoromethane","CH3F",7.0975999999999999,740.22,253.89]
[25,"iodomethane","CH3I",6.9880000000000004,1146.3399999999999,236.66]
[26,"nitromethane","CH3NO2",7.0439999999999996,1291,209.01]
[28,"Etilbenceno","C8H10",6.8257199709892227,1417.6348514178712,213.72941796115342]
[29,"methane","CH4",6.6956100000000003,405.42,267.77699999999999]
[30,"methanol","CH4O",8.0724,1574.99,238.87]
[31,"methanethiol","CH4S",7.0316299999999998,1015.547,238.70599999999999]
[32,"methylamine","CH5N",7.4969000000000001,1079.1500000000001,240.24]
[33,"tetrachloroethene","C2CL4",7.02,1415.49,221.01]
[34,"hexachloroethane","C2CL6",7.0863300000000002,1626.9449999999999,197.048]
[35,"112trichlorotrifluoroethane","C2CL3F3",6.8803000000000001,1099.9000000000001,227.5]
[36,"12dichlorotetrafluoroethane","C2CL2F4",6.8708400000000003,942.33600000000001,232.63200000000001]
[37,"chloropentafluoroethane","C2CLF5",6.8333000000000004,802.97,242.28]
[38,"tetrafluoroethene","C2F4",6.8966000000000003,683.84,245.94]
[38,"Acetato de Metilo","C3H6O2",7.0230120851481947,1157.9532489212011,221.16917490290058]
[39,"hexafluoroethane","C2F6",6.7933000000000003,657.06,246.22]
[40,"cyanogen","C2N2",6.4362899999999996,576.57899999999995,182.30799999999999]
[41,"trichloroethene","C2HCL3",7.0281000000000002,1315.1,230.01]
[42,"pentachloroethane","C2HCL5",6.74,1378,197]
[43,"trifluoroethene","C2HF3",5.6871499999999999,491.35899999999998,227.23]
[44,"acetylene (ethyne)","C2H2",9.1402000000000001,1232.5999999999999,280.89999999999998]
[45,"1,1-dichloroethene","C2H2CL2",6.9722,1099.4000000000001,237.2]
[46,"cis-1,2-dichloroethene","C2H2CL2",7.0223000000000004,1205.4000000000001,230.6]
[46,"1-Propanol","C3H8O",4.9999099999999999,1512.94,205.80699999999999]
[47,"trans-1,2-dichloroethene","C2H2CL2",6.9650999999999996,1141.9000000000001,231.9]
[48,"1,1,2,2-tetrachloroethane","C2H2CL4",6.6317000000000004,1228.0999999999999,179.9]
[49,"1,1-difluoroethene","C2H2F2",6.3491799999999996,491.35899999999998,227.239]
[49,"2-Propanol","C3H8O",5.24268,1580.92,219.61]
[50,"cis-1,2-difluoroethene","C2H2F2",5.3140099999999997,491.35899999999998,227.23]
[51,"trans-1,2-difluoroethene","C2H2F2",5.3140099999999997,491.35899999999998,227.23]
[52,"ketene","C2H2O",6.9573,803.1,238.01]
[53,"bromoethylene","C2H3BR",7.2437899999999997,1219.308,264.02100000000002]
[54,"chloroethene","C2H3CL",6.4970999999999997,783.4,230.01]
[55,"1,1,2-trichloroethane","C2H3CL3",6.9653,1351,217]
[56,"acetyl-chloride","C2H3CLO",6.8407,1062.8599999999999,217.63]
[57,"fluoroethene","C2H3F",6.3394899999999996,593.55100000000004,243.11099999999999]
[58,"1,1,1-trifluoroethane","C2H3F3",6.9038000000000004,788.21,243.24]
[59,"acetonitrile","C2H3N",7.0735000000000001,1279.2,224.01]
[60,"ethylene","C2H4",6.74756,585,255]
[61,"1,2-dibromoethane","C2H4BR2",6.7214799999999997,1280.82,201.75]
[62,"1,1-dichloroethane","C2H4CL2",6.9852999999999996,1171.42,228.13]
[63,"1,2-dichloroethane","C2H4CL2",7.0252999999999997,1271.25,222.94]
[64,"1,1-difluoroethane","C2H4F2",7.03,910,244]
[65,"1,2-diiodoethane","C2H4I2",6.98834,1647.1,201]
[66,"ethylene-oxide","C2H4O",7.2701000000000002,1115.0999999999999,244.15]
[67,"acetaldehyde","C2H40",7.0564999999999998,1070.5999999999999,236.01]
[68,"acetic-acid","C2H4O2",7.2995999999999999,1479.02,216.82]
[69,"methyl-formate","C2H4O2",7.1703999999999999,1125.2,230.56]
[70,"thioacetic-acid","C2H4OS",7.7488900000000003,1479.02,216.82]
[71,"thiacyclopropane","C2H4S",7.0372500000000002,1194.3699999999999,232.42]
[72,"bromoethane","C2H5BR",6.92,1090.81,231.72]
[73,"chloroethane (Cloruro de etilo)","C2H5Cl",6.94,1012.78,236.68]
[74,"fluoroethane","C2H5F",6.9785000000000004,854.21,246.16]
[75,"iodoethane","C2H5I",6.9589999999999996,1232,229]
[76,"ethylenimine","C2H5N",7.1322999999999999,1133.7,210.01]
[77,"nitroethane","C2H5NO2",7.5877699999999999,1671.2660000000001,241.18700000000001]
[78,"ethyl-nitrate","C2H5NO3",7.1637000000000004,1338.8,224.9]
[79,"ethane","C2H6",6.8345200000000004,663.7,256.47000000000003]
[80,"methyl-ether","C2H6O",7.3163999999999998,1025.56,256.06]
[81,"ethyl-alcohol (ethanol)","C2H6O",8.2133000000000003,1652.05,231.48]
[82,"ethylene-glycol","C2H6O2",8.7944999999999993,2615.4,244.91]
[83,"methyl-sulfide","C2H6S",6.9487899999999998,1090.7550000000001,230.79900000000001]
[84,"ethanethiol","C2H6S",6.9520600000000004,1084.5309999999999,231.38499999999999]
[85,"methyl-disulfide","C2H6S2",6.9779200000000001,1346.3420000000001,218.863]
[86,"ethylamine","C2H7N",7.3861999999999997,1137.3,235.86]
[87,"dimethylamine","C2H7N",7.0639000000000003,1024.4000000000001,238.01]
[88,"acrylonitrile","C3H3N",6.9162999999999997,1208.3,222.01]
[89,"allene(propadiene)","C3H4",5.7137000000000002,458.06,196.07]
[90,"propyne(methylacetylene)","C3H4",6.7848499999999996,803.73,229.08]
[91,"acrylic-acid","C3H4O2",7.1925999999999997,1441.5,193.01]
[92,"3-bromo-1-propene","C3H5BR",7.0518700000000001,1259.83,232.04]
[93,"3-chloro-1-propene","C3H5CL",6.9387999999999996,1099.5999999999999,226.01]
[94,"1,2,3-trichloropropane","C3H5CL3",7.0027999999999997,1484.1,204.01]
[95,"3-iodo-1-propene","C3H5I",6.9692999999999996,1316.5,220]
[96,"propionitrile","C3H5N",6.9301000000000004,1277.2,218.01]
[97,"propene  (Propileno)","C3H6",6.8196000000000003,785,247]
[98,"cyclopropane","C3H6",6.8879000000000001,856.01,246.51]
[99,"1,2-dibromopropane","C3H6BR2",6.8910499999999999,1419.6,212]
[100,"1,2-dichloropropane","C3H6CL2",6.9653999999999998,1296.4000000000001,221]
[101,"1,3-dichloropropane","C3H6CL2",6.9718600000000004,1376.2,216]
[102,"2,2-dichloropropane","C3H6CL2",6.9481999999999999,1201.0999999999999,226]
[103,"1,2-diiodopropane","C3H6I2",6.0765000000000002,1507.41,244.7]
[104,"propylene-oxide","C3H6O",6.6546000000000003,915.31,208.29]
[105,"allyl-alcohol","C3H6O",7.3423999999999996,1271.7,188.01]
[106,"propionaldehyde","C3H6O",7.0492999999999997,1154.8,229.01]
[107,"acetone","C3H6O",7.2316000000000003,1277.03,237.23]
[108,"thiacyclobutane","C3H6S",7.0166700000000004,1321.3309999999999,224.51300000000001]
[109,"1-bromopropane","C3H7BR",7.0376599999999998,1259.836,232.042]
[110,"2-bromopropane","C3H7BR",7.0046299999999997,1223.4749999999999,236.50800000000001]
[111,"1-chloropropane","C3H7CL",6.9310999999999998,1121.1199999999999,230.21]
[112,"2-chloropropane","C3H7CL",6.9653999999999998,1081.5999999999999,230.01]
[113,"1-fluoropropane","C3H7F",6.9532999999999996,965.18,239.5]
[114,"2-fluoropropane","C3H7F",7.0745100000000001,965.18,239.5]
[115,"1-iodopropane","C3H7I",7.2212100000000001,1507.41,244.70099999999999]
[116,"2-iodopropane","C3H7I",7.0167000000000002,1340.4480000000001,234.36500000000001]
[117,"1-nitropropane","C3H7NO2",7.1146000000000003,1467.45,215.23]
[118,"2-nitropropane","C3H7NO2",7.4865399999999998,1664.0360000000001,240.995]
[119,"propyl-nitrate","C3H7NO3",7.73719,1721.723,245.49]
[120,"isopropyl-nitrate","C3H7NO3",6.4200600000000003,1018.568,183.52799999999999]
[121,"propane","C3H8",6.8039800000000001,803.81,246.99]
[122,"ethyl-methyl-ether","C3H8O",5.8818999999999999,504.49,160.76]
[123,"propyl-alcohol","C3H8O",7.6192000000000002,1375.14,193.01]
[124,"isopropyl-alcohol","C3H8O",8.1181999999999999,1580.92,219.62]
[125,"ethyl-methyl-sulfide","C3H8S",6.9384899999999998,1182.5619999999999,224.78399999999999]
[126,"1-propanethiol","C3H8S",6.9284600000000003,1183.307,224.624]
[127,"2-propanethiol","C3H8S",6.8773400000000002,1113.895,226.15700000000001]
[128,"propylamine","C3H9N",6.9467999999999996,1108.2,224.01]
[129,"trimethylamine","C3H9N",6.9703999999999997,968.7,234.01]
[130,"octafluorocyclobutane","C4F8",6.8152999999999997,862.49,225.15]
[131,"butadiyne(biacetylene)","C4H2",5.5191699999999999,460.68400000000003,164.59399999999999]
[132,"1buten3yne(vinylacetylene)","C4H4",6.9530000000000003,957,230.01]
[133,"furan","C4H4O",6.9752999999999998,1060.8499999999999,227.75]
[134,"thiophene","C4H4S",6.9592599999999996,1246.02,221.35]
[135,"1,2-butadiene","C4H6",6.99383,1041.117,242.274]
[136,"1,3-butadiene","C4H6",6.84999,930.54600000000005,238.85400000000001]
[137,"1-butyne(ethylacetylene)","C4H6",6.9819800000000001,988.75,233.01]
[138,"2-butyne(dimethylacetylene)","C4H6",7.0733800000000002,1101.71,235.81]
[139,"cyclobutene","C4H6",6.9576900000000004,1009.32,244.98599999999999]
[140,"acetic-anhydride","C4H6O3",7.1215999999999999,1427.77,198.05]
[141,"butyronitrile","C4H7N",7.0396000000000001,1390.7,217]
[142,"isobutyronitrile","C4H7N",7.21591,1390.7,217]
[143,"1-butene","C4H8",6.8429000000000002,926.1,240]
[144,"2-butene,cis","C4H8",6.8692599999999997,960.1,237]
[145,"2-butene,trans","C4H8",6.8695199999999996,960.8,240]
[146,"2-methylpropene  (Isobutileno)","C4H8",6.8413399999999998,923.2,240]
[147,"cyclobutane","C4H8",6.9162999999999997,1024.54,241.38]
[148,"1,2-dibromobutane","C4H8BR2",7.2569600000000003,1759.076,235.00899999999999]
[149,"2,3-dibromobutane","C4H8BR2",7.2002300000000004,1691.481,230.22300000000001]
[150,"1,2-diiodobutane","C4H8I2",6.2432999999999996,1507.41,244.7]
[151,"butyraldehyde","C4H8O",7.0212000000000003,1233,223.01]
[152,"2-butanone  (Metil Etil Cetona)","C4H8O ",7.2087000000000003,1368.21,236.51]
[153,"p-dioxane","C4H8O2",7.0063000000000004,1288.5,211.01]
[154,"ethyl-acetate","C4H8O2",7.0145999999999997,1211.9000000000001,216.01]
[155,"thiacyclopentane","C4H8S",6.9954000000000001,1401.9390000000001,219.607]
[156,"1-bromobutane","C4H9BR",6.9225399999999997,1298.6079999999999,219.7]
[157,"2-bromobutane","C4H9BR",6.8272399999999998,1229.08,220]
[158,"2-bromo-2-methylpropane","C4H9BR",6.6684999999999999,1129.7,225]
[159,"1-chlorobutane","C4H9CL",6.9379,1227.43,224.11]
[160,"2-chlorobutane","C4H9CL",6.9447000000000001,1195.8,226.01]
[161,"1-chloro-2-methylpropane","C4H9CL",6.9530399999999997,1205.079,227.04599999999999]
[162,"2-chloro-2-methylpropane","C4H9CL",6.8670999999999998,1114.9000000000001,229.01]
[163,"2-iodo-2-methylpropane","C4H9I",7.2538999999999998,1507.41,244.7]
[164,"pyrrolidine","C4H9N",6.9245999999999999,1179.99,205.26]
[165,"1-nitrobutane","C4H9NO2",6.8671499999999996,1467.45,215.23]
[166,"2-nitrobutane","C4H9NO2",7.25197,1664.03,240.99]
[167,"butane  (n-butano)","C4H10",6.8089599999999999,935.86,238.73]
[168,"2-methylpropane (isobutane)","C4H10",6.9104799999999997,946.35,246.68]
[169,"ethyl-ether (Eter dietílico)","C4H10O",6.9203200000000002,1064.07,228.8]
[170,"methyl-propyl-ether","C4H10O",6.1185999999999998,708.69,179.9]
[171,"methyl-isopropyl-ether","C4H10O",6.2449500000000002,708.69,179.9]
[172,"butyl-alcohol  (1-Butanol)","C4H10O",7.4767999999999999,1362.39,178.73]
[173,"sec-butyl-alcohol","C4H10O",7.4743000000000004,1314.19,186.51]
[174,"tert-butyl-alcohol","C4H10O",7.3198999999999996,1154.48,177.66]
[175,"ethylsulfide","C4H10S",6.9283599999999996,1257.8330000000001,218.66200000000001]
[176,"isopropyl-methyl-sulfide","C4H10S",6.9019599999999999,1232.17,221.67]
[177,"methyl-propyl-sulfide","C4H10S",6.9554499999999999,1284.32,219.66]
[178,"1-butanethiol","C4H10S",6.9275399999999996,1281.018,218.1]
[179,"2-butanethiol","C4H10S",6.8869800000000003,1229.904,222.02099999999999]
[180,"2-methyl-1-propanethiol","C4H10S",6.8874599999999999,1237.2819999999999,220.31299999999999]
[181,"2-methyl-2-propanethiol","C4H10S",6.7878100000000003,1115.5650000000001,221.31399999999999]
[182,"ethyl-disulfide","C4H10S2",6.9750699999999997,1485.97,208.958]
[183,"butylamine","C4H11N",7.2130000000000001,1308.4000000000001,224.2]
[184,"sec-butylamine","C4H11N",7.15069,1238.3,227]
[185,"tert-butylamine","C4H11N",6.7830899999999996,993.26199999999994,210.49299999999999]
[186,"diethylamine","C4H11N",6.9724000000000004,1127,220.01]
[187,"pyridine","C5H5N",6.9882,1344.2,212.01]
[188,"2-methylthiophene","C5H6S",6.9389700000000003,1326.48,214.31]
[189,"3-methylthiophene","C5H6S",6.98611,1363.84,216.78]
[190,"1,2-pentadiene","C5H8",6.9181999999999997,1104.991,228.851]
[191,"1,3-pentadiene,cis","C5H8",6.9108900000000002,1101.923,229.36699999999999]
[192,"1,3-pentadiene,trans","C5H8",6.91317,1103.8399999999999,231.72399999999999]
[193,"1,4-pentadiene","C5H8",6.8354299999999997,1017.995,231.46100000000001]
[194,"2,3-pentadiene","C5H8",6.9621599999999999,1126.837,227.84100000000001]
[195,"3-methyl-1,2-butadiene","C5H8",6.9435000000000002,1103.9010000000001,230.89]
[196,"2-methyl-1,3-butadiene","C5H8",6.8856400000000004,1071.578,233.51300000000001]
[197,"1-pentyne","C5H8",6.9672999999999998,1092.52,227.19]
[198,"2-pentyne","C5H8",7.0461400000000003,1189.8699999999999,229.6]
[199,"3-methyl-1-butyne","C5H8",6.8848000000000003,1014.81,227.11]
[200,"cyclopentene","C5H8",6.9207000000000001,1121.81,233.46]
[201,"spiropentane","C5H8",6.9169999999999998,1090.08,231.1]
[202,"1-pentene","C5H10",6.8464999999999998,1044.895,233.51599999999999]
[203,"2-pentene,cis","C5H10",6.8727400000000003,1067.951,230.58500000000001]
[204,"2-pentene,trans","C5H10",6.9057500000000003,1083.9870000000001,232.965]
[205,"2-methyl-1-butene","C5H10",6.8731400000000002,1053.78,232.78800000000001]
[206,"3-methyl-1-butene","C5H10",6.8261799999999999,1013.474,236.816]
[207,"2-methyl-2-butene","C5H10",6.9156199999999997,1095.088,232.84200000000001]
[208,"cyclopentane","C5H10",6.8867599999999998,1124.162,231.36099999999999]
[209,"2,3-dibromo-2-methylbutane","C5H10BR2",7.3673500000000001,1695.9,207]
[210,"valeraldehyde","C5H10O",7.0191999999999997,1316,215.01]
[211,"2-pentanone","C5H10O",6.95,1274.5999999999999,210.91]
[212,"thiacyclohexane","C5H10S",6.9051799999999997,1422.47,211.72]
[213,"cyclopentanethiol","C5H10S",6.9149700000000003,1388.63,212.05]
[214,"1-bromopentane","C5H11BR",6.9558,1401.634,214.38]
[215,"1-chloropentane","C5H11CL",6.96617,1332.89,218.5]
[216,"1-chloro-3-methylbutane","C5H11CL",6.7952700000000004,1258.5,223]
[217,"2-chloro-2-methylbutane","C5H11CL",6.9590199999999998,1258.5,223]
[218,"pentane  (n-pentano)","C5H12",6.8763199999999998,1075.78,233.20500000000001]
[219,"2-methylbutane(isopentane)","C5H12",6.8331499999999998,1040.73,235.44499999999999]
[220,"2,2-dimethypropane","C5H12",6.6042699999999996,883.42,227.78200000000001]
[221,"methyl-tert-butyl-ether  (Eter metil t-butílico)","C5H12O",5.8959999999999999,708.69,179.9]
[222,"pentyl-alcohol","C5H12O",7.1776,1314.56,168.16]
[223,"tert-pentyl-alcohol","C5H12O",7.8753000000000002,1604.7,208.16]
[224,"butyl-methyl-sulfide","C5H12S",6.9458299999999999,1363.808,212.07400000000001]
[225,"ethyl-propyl-sulfide","C5H12S",6.9337999999999997,1341.57,212.51]
[226,"2-methyl-2-butanethiol","C5H12S",6.8283699999999996,1254.885,218.75899999999999]
[227,"1-pentanethiol","C5H12S",6.9331100000000001,1369.479,211.31399999999999]
[228,"hexachlorobenzene","C6CL6",9.7860200000000006,4597.57,355.96100000000001]
[229,"hexafluorobenzene","C6F6",7.0330000000000004,1227.98,215.5]
[230,"o-dichlorobenzene","C6H4CL2",7.0702999999999996,1649.55,213.32]
[231,"m-dichlorobenzene","C6H4CL2",7.3037000000000001,1782.4,230.01]
[232,"p-dichlorobenzene","C6H4CL2",6.9980000000000002,1575.11,208.52]
[233,"m-difluorobenzene","C6H4F2",7.0658200000000004,1310.27,222.58]
[234,"o-difluorobenzene","C6H4F2",7.0203100000000003,1310.271,222.58699999999999]
[235,"p-difluorobenzene","C6H4F2",7.08812,1310.27,222.58]
[236,"bromobenzene","C6H5BR",6.8605999999999998,1438.82,205.45]
[237,"chlorobenzene","C6H5Cl",6.9781000000000004,1431.05,217.56]
[238,"fluorobenzene","C6H5F",7.1870000000000003,1381.83,235.57]
[239,"iodobenzene","C6H5I",7.0118999999999998,1640.13,208.78]
[240,"benzene","C6H6",6.9056499999999996,1211.0329999999999,220.79]
[241,"phenol","C6H6O",7.1345000000000001,1516.07,174.57]
[242,"benzenethiol","C6H6S",6.9901900000000001,1529.454,203.048]
[243,"2-picoline","C6H7N",7.0324,1415.73,211.58]
[244,"3-picoline","C6H7N",7.0502000000000002,1481.77,211.21]
[245,"aniline","C6H7N",7.2417999999999996,1675.3,200.01]
[246,"1-hexyne","C6H10",6.9121199999999998,1194.5999999999999,225]
[247,"cyclohexene","C6H10",6.8723999999999998,1221.9000000000001,223.18]
[248,"1-methylcyclopentene","C6H10",6.8688399999999996,1199.5999999999999,225]
[249,"3-methylcyclopentene","C6H10",6.8725899999999998,1165.5999999999999,227]
[250,"4-methylcyclopentene","C6H10",6.8701499999999998,1197.5999999999999,225]
[251,"cyclohexanone","C6H10O",6.97851,1495.58,209.559]
[252,"1-hexene","C6H12",6.8657199999999996,1152.971,225.84899999999999]
[253,"2-hexene,cis","C6H12",7.0380500000000001,1258.5709999999999,233.851]
[254,"2-hexene,trans","C6H12",6.8934199999999999,1173.3430000000001,224.53]
[255,"3-hexene,cis","C6H12",6.8785400000000001,1164.134,224.749]
[256,"3-hexene,trans","C6H12",6.9177999999999997,1180.7070000000001,225.38399999999999]
[257,"2-methyl-1-pentene","C6H12",6.8502999999999998,1138.5160000000001,224.70400000000001]
[258,"3-methyl-1-pentene","C6H12",6.7552300000000001,1086.316,226.20400000000001]
[259,"4-methyl-1-pentene","C6H12",6.8352899999999996,1121.3019999999999,229.68700000000001]
[260,"2-methyl-2-pentene","C6H12",6.9236700000000004,1183.837,225.51400000000001]
[261,"3-methyl-2-pentene,cis","C6H12",6.91073,1186.402,226.696]
[262,"3-methyl-2-pentene,trans","C6H12",6.9263399999999997,1194.527,224.833]
[263,"4-methyl-2-pentene,cis","C6H12",6.8412899999999999,1120.7070000000001,226.58600000000001]
[264,"4-methyl-2-pentene,trans","C6H12",6.8803000000000001,1142.874,227.143]
[265,"2-ethyl-1-butene","C6H12",6.9971199999999998,1218.3520000000001,231.3]
[266,"2,3-dimethyl-1-butene","C6H12",6.8623599999999998,1134.675,229.36699999999999]
[267,"3,3-dimethyl-1-butene","C6H12",6.6775099999999998,1010.516,224.90899999999999]
[268,"2,3-dimethyl-2-butene","C6H12",6.9505800000000004,1215.4280000000001,225.44300000000001]
[269,"cyclohexane","C6H12",6.8413000000000004,1201.5309999999999,222.64699999999999]
[270,"methylcyclopentane","C6H12",6.8628299999999998,1186.059,226.042]
[271,"cyclohexanol","C6H12O",6.2553000000000001,912.87,109.13]
[272,"hexanal","C6H12O",6.7144199999999996,1316,215.01]
[273,"thiacycloheptane","C6H12S",6.9052300000000004,1422.47,211.72]
[274,"hexane","C6H14",6.8702399999999999,1168.72,224.21]
[275,"2-methylpentane","C6H14",6.8391000000000002,1135.4100000000001,226.572]
[276,"3-methylpentane","C6H14",6.8188700000000004,1152.3679999999999,227.12899999999999]
[277,"2,2-dimethylbutane","C6H14",6.7548300000000001,1081.1759999999999,229.34299999999999]
[278,"2,3-dimethylbutane","C6H14",6.8098299999999998,1127.1869999999999,228.9]
[279,"propyl-ether","C6H14O",6.9476000000000004,1256.5,219]
[280,"isopropyl-ether","C6H14O",7.0971000000000002,1257.5999999999999,230.01]
[281,"1-Hexanol","C6H14O",7.8604000000000003,1761.26,196.67]
[282,"butyl-ethyl-sulfide","C6H14S",6.94102,1421.32,205.81]
[283,"isopropyl-sulfide","C6H14S",6.8711799999999998,1327.12,212.55]
[284,"methyl-pentyl-sulfide","C6H14S",7.1160899999999998,1413.44,205.73]
[285,"propyl-sulfide","C6H14S",6.9357699999999998,1413.44,205.73]
[286,"1-hexanethiol","C6H14S",6.9466400000000004,1454.0039999999999,204.95400000000001]
[287,"propyl-disulfide","C6H14S2",6.9752900000000002,1603.7929999999999,195.84800000000001]
[288,"triethylamine","C6H15N",6.8989000000000003,1251.8,222.01]
[289,"a,a,a-trifluorotoluene","C7H5F3",6.9704499999999996,1306.3499999999999,217.38]
[290,"benzonitrile","C7H5N",7.7291100000000004,2110.5720000000001,244.81899999999999]
[291,"benzoic-acid","C7H6O2",7.4539999999999997,1820,147.96]
[292,"p-fluorotoluene","C7H7F",6.9942599999999997,1374.0550000000001,217.4]
[293,"toluene","C7H8",6.9546400000000004,1344.8,219.482]
[294,"1,3,5-cycloheptatriene","C7H8",6.9743300000000001,1376.84,220.75]
[295,"m-cresol","C7H8O",7.508,1856.36,199.07]
[296,"o-cresol","C7H8O",6.9116999999999997,1435.5,165.16]
[297,"p-cresol","C7H8O",7.0350999999999999,1511.08,161.86000000000001]
[298,"1-heptyne","C7H12",6.6859299999999999,1216.5999999999999,220]
[299,"1-heptene","C7H14",6.90069,1257.5050000000001,219.179]
[300,"cycloheptane","C7H14",6.8539000000000003,1331.57,216.36]
[301,"ethylcyclopentane","C7H14",6.8870899999999997,1298.5989999999999,220.67500000000001]
[302,"1,1-dimethylcyclopentane","C7H14",6.81724,1219.4739999999999,221.946]
[303,"c-1,2-dimethylcyclopentane","C7H14",6.8500800000000002,1269.1400000000001,220.209]
[304,"t-1,2-dimethylcyclopentane","C7H14",6.84422,1242.748,221.68600000000001]
[305,"c-1,3-dimethylcyclopentane","C7H14",6.8371500000000003,1237.4559999999999,222.005]
[306,"t-1,3-dimethylcyclopentane","C7H14",6.8381699999999999,1240.0229999999999,221.62100000000001]
[307,"methylcyclohexane","C7H14",6.8230000000000004,1270.7629999999999,221.416]
[308,"heptanal","C7H14O",5.4758699999999996,686.45299999999997,111.81699999999999]
[309,"heptane","C7H16",6.8938499999999996,1264.3699999999999,216.636]
[310,"2-methylhexane","C7H16",6.8731799999999996,1236.0260000000001,219.54499999999999]
[311,"3-methylhexane","C7H16",6.8676399999999997,1240.1959999999999,219.22300000000001]
[312,"3-ethylpentane","C7H16",6.8756399999999998,1251.827,219.887]
[313,"2,2-dimethylpentane","C7H16",6.8148,1190.0329999999999,223.303]
[314,"2,3-dimethylpentane","C7H16",6.8538199999999998,1238.0170000000001,221.82300000000001]
[315,"2,4-dimethylpentane","C7H16",6.8262099999999997,1192.0409999999999,221.63399999999999]
[316,"3,3-dimethylpentane","C7H16",6.82667,1228.663,225.316]
[317,"2,2,3-trimethylbutane","C7H16",6.7923,1200.5630000000001,226.05]
[318,"isopropyl-tert-butyl-ether","C7H16O",6.62913,1257.5999999999999,230.01]
[319,"heptyl-alcohol","C7H16O",6.6475999999999997,1140.6400000000001,126.56]
[320,"butyl-propyl-sulfide","C7H16S",6.6527900000000004,1421.32,205.81]
[321,"ethyl-pentyl-sulfide","C7H16S",6.6527900000000004,1421.32,205.81]
[322,"hexyl-methyl-sulfide","C7H16S",6.6527900000000004,1421.32,205.81]
[323,"1-heptanethiol","C7H16S",6.9524900000000001,1525.3109999999999,197.696]
[324,"ethynylbenzene","C8H6",6.9569999999999999,1445.58,209.44]
[325,"styrene","C8H8",6.9570999999999996,1445.58,209.44]
[326,"1,3,5,7-cyclooctatetraene","C8H8",7.0066899999999999,1472.11,215.84]
[327,"ethylbenzene","C8H10",6.9571899999999998,1424.2550000000001,213.20599999999999]
[328,"m-xylene","C8H10",7.00908,1462.2660000000001,215.10499999999999]
[329,"o-xylene","C8H10",6.9989100000000004,1474.6790000000001,213.68600000000001]
[330,"p-xylene","C8H10",6.9905200000000001,1453.43,215.30699999999999]
[331,"1-octyne","C8H14",7.02447,1413.8,215]
[332,"1-octene","C8H16",6.9326299999999996,1353.4860000000001,212.76400000000001]
[333,"cyclooctane","C8H16",6.8619000000000003,1437.78,209.98]
[334,"propylcyclopentane","C8H16",6.9039200000000003,1384.386,213.15899999999999]
[335,"ethylcyclohexane","C8H16",6.8672800000000001,1382.4659999999999,214.995]
[336,"1,1-dimethylcyclohexane","C8H16",6.7982100000000001,1321.7049999999999,217.845]
[337,"c-1,2-dimethylcyclohexane","C8H16",6.8374600000000001,1367.3109999999999,215.83500000000001]
[338,"t-1,2-dimethylcyclohexane","C8H16",6.8330799999999998,1353.8810000000001,219.13200000000001]
[339,"c-1,3-dimethylcyclohexane","C8H16",6.8388299999999997,1338.473,218.072]
[340,"t-1,3-dimethylcyclohexane","C8H16",6.8345500000000001,1343.6869999999999,215.39400000000001]
[341,"c-1,4-dimethylcyclohexane","C8H16",6.8328699999999998,1345.6130000000001,216.154]
[342,"t-1,4-dimethylcyclohexane","C8H16",6.8177300000000001,1330.4369999999999,218.58099999999999]
[343,"octanal","C8H16O",12.51168,3977.5309999999999,244.53200000000001]
[344,"octane","C8H18",6.9093999999999998,1349.82,209.38499999999999]
[345,"2-methylheptane","C8H18",6.9173499999999999,1337.4680000000001,213.69300000000001]
[346,"3-methylheptane","C8H18",6.8994400000000002,1331.53,212.41399999999999]
[347,"4-methylheptane","C8H18",6.9006499999999997,1327.6610000000001,212.56800000000001]
[348,"3-ethylhexane","C8H18",6.8909799999999999,1327.884,212.595]
[349,"2,2-dimethylhexane","C8H18",6.8371500000000003,1273.5940000000001,215.072]
[350,"2,3-dimethylhexane","C8H18",6.8700400000000004,1315.5029999999999,214.15700000000001]
[351,"2,4-dimethylhexane","C8H18",6.8530499999999996,1287.876,214.79]
[352,"2,5-dimethylhexane","C8H18",6.8598400000000002,1287.2739999999999,214.41200000000001]
[353,"3,3-dimethylhexane","C8H18",6.85121,1307.8820000000001,217.43899999999999]
[354,"3,4-dimethylhexane","C8H18",6.8798599999999999,1330.0350000000001,214.863]
[355,"3-ethyl-2-methylpentane","C8H18",6.8635799999999998,1318.12,215.30600000000001]
[356,"3-ethyl-3-methylpentane","C8H18",6.8673099999999998,1347.2090000000001,219.684]
[357,"2,2,3-trimethylpentane","C8H18",6.8254599999999996,1294.875,218.42]
[358,"2,2,4-trimethylpentane","C8H18",6.81189,1257.8399999999999,220.73500000000001]
[359,"2,3,3-trimethylpentane","C8H18",6.8435300000000003,1328.046,220.375]
[360,"2,3,4-trimethylpentane","C8H18",6.8539599999999998,1315.0840000000001,217.52600000000001]
[361,"2,2,3,3-tetramethylbutane","C8H18",6.8766499999999997,1329.93,226.36]
[362,"butyl-ether","C8H18O",6.9824999999999999,1431.5,207.01]
[363,"sec-butyl-ether","C8H18O",6.7915299999999998,1348.53,223.79]
[364,"tert-butyl-ether","C8H18O",6.9329400000000003,1348.5329999999999,223.79]
[365,"octyl-alcohol","C8H18O",6.8369999999999997,1310.6199999999999,136.06]
[366,"butyl-sulfide","C8H18S",6.54589,1421.32,205.81]
[367,"ethyl-hexyl-sulfide","C8H18S",6.4269299999999996,1421.32,205.81]
[368,"heptyl-methyl-sulfide","C8H18S",6.4269299999999996,1421.32,205.81]
[369,"pentyl-propyl-sulfide","C8H18S",6.4269299999999996,1421.32,205.81]
[370,"1-octanethiol","C8H18S",6.9690899999999996,1593,190.61]
[371,"butyl-disulfide","C8H18S2",6.9638,1684.1,181.3]
[372,"alpha-methylstyrene","C9H10",7.0923999999999996,1582.7,206.01]
[373,"propenylbenzene,cis","C9H10",7.4496099999999998,1909.0830000000001,238.874]
[374,"propenylbenzene,trans","C9H10",7.5499299999999998,1909.08,238.87]
[375,"m-methylstyrene","C9H10",6.8792799999999996,1471.44,200]
[376,"o-methylstyrene","C9H10",6.8846100000000003,1485.41,200]
[377,"p-methylstyrene","C9H10",7.0111999999999997,1535.1,200.7]
[378,"propylbenzene","C9H12",6.9514199999999997,1491.297,207.14]
[379,"cumene","C9H12",6.9366599999999998,1460.7929999999999,207.77699999999999]
[380,"m-ethyltoluene","C9H12",7.0158199999999997,1529.184,208.50899999999999]
[381,"o-ethyltoluene","C9H12",7.0031400000000001,1535.374,207.3]
[382,"p-ethyltoluene","C9H12",6.9980200000000004,1527.1130000000001,208.92099999999999]
[383,"1,2,3-trimethylbenzene","C9H12",7.0408200000000001,1593.9580000000001,207.078]
[384,"1,2,4-trimethylbenzene","C9H12",7.0438299999999998,1573.2670000000001,208.56399999999999]
[385,"mesitylene","C9H12",7.0743600000000004,1569.6220000000001,209.578]
[386,"1-nonyne","C9H16",6.7740999999999998,1404.7,210]
[387,"1-nonene","C9H18",6.9538700000000002,1435.3589999999999,205.535]
[388,"butylcyclopentane","C9H18",6.8993500000000001,1457.08,205.99]
[389,"propylcyclohexane","C9H18",6.8864599999999996,1460.8,207.93899999999999]
[390,"c-c-135trimethylcyclohexane","C9H18",7.0974300000000001,1460.8,207.93]
[391,"c-t-135trimethylcyclohexane","C9H18",7.0727399999999996,1460.8,207.93]
[392,"nonanal","C9H18O",7.8150500000000003,2036.854,227.48599999999999]
[393,"nonane  (n-Nonano)","C9H20",6.9344000000000001,1429.46,201.82]
[394,"2-methyloctane","C9H20",6.9119099999999998,1398.42,203.65]
[395,"3-methyloctane","C9H20",6.9092000000000002,1405.8,204.76]
[396,"4-methyloctane","C9H20",6.9031799999999999,1399.12,205.41]
[397,"3-ethylheptane","C9H20",6.90489,1406.5,206.5]
[398,"4-ethylheptane","C9H20",6.8989799999999999,1399.8,207.2]
[399,"2,2-dimethylheptane","C9H20",6.8817399999999997,1363.91,208.21]
[400,"2,3-dimethylheptane","C9H20",6.8763500000000004,1389.5,207.3]
[401,"2,4-dimethylheptane","C9H20",6.90252,1368.72,207.44]
[402,"2,5-dimethylheptane","C9H20",6.8931699999999996,1375.4,206.8]
[403,"2,6-dimethylheptane","C9H20",6.8938499999999996,1368,205.68]
[404,"3,3-dimethylheptane","C9H20",6.8755300000000004,1385.36,209.79]
[405,"3,4-dimethylheptane","C9H20",6.8835899999999999,1396.9,208.4]
[406,"3,5-dimethylheptane","C9H20",6.9016400000000004,1382.8,207.9]
[407,"4,4-dimethylheptane","C9H20",6.8696799999999998,1378.7,210.4]
[408,"3-ethyl-2-methylhexane","C9H20",6.8868999999999998,1390.2,209]
[409,"4-ethyl-2-methylhexane","C9H20",6.9002999999999997,1376.1,208.6]
[410,"3-ethyl-3-methylhexane","C9H20",6.8778699999999997,1406.8,211.4]
[411,"3-ethyl-4-methylhexane","C9H20",6.8943000000000003,1404.3,209.5]
[412,"2,2,3-trimethylhexane","C9H20",6.8657399999999997,1375.72,211.63]
[413,"2,2,4-trimethylhexane","C9H20",6.8492199999999999,1340.9,211.35]
[414,"2,2,5-trimethylhexane","C9H20",6.8353099999999998,1324.049,210.73699999999999]
[415,"2,3,3-trimethylhexane","C9H20",6.8541699999999999,1389.79,212.1]
[416,"2,3,4-trimethylhexane","C9H20",6.8527399999999998,1387.22,210.22]
[417,"2,3,5-trimethylhexane","C9H20",6.8707799999999999,1359.09,209.29]
[418,"2,4,4-trimethylhexane","C9H20",6.8516300000000001,1368.723,214.047]
[419,"3,3,4-trimethylhexane","C9H20",6.8576100000000002,1403.88,212.56]
[420,"3,3-diethylpentane","C9H20",6.89262,1451.2449999999999,215.57499999999999]
[421,"3-ethyl-2,2-dimethylpentane","C9H20",6.8716600000000003,1383.13,212.75]
[422,"3-ethyl-2,3-dimethylpentane","C9H20",6.8446300000000004,1418,213]
[423,"3-ethyl-2,4-dimethylpentane","C9H20",6.8529299999999997,1380.54,210.87]
[424,"2,2,3,3-tetramethylpentane","C9H20",6.8287599999999999,1397.4829999999999,213.703]
[425,"2,2,3,4-tetramethylpentane","C9H20",6.8317300000000003,1374.0419999999999,214.762]
[426,"2,2,4,4-tetramethylpentane","C9H20",6.7971000000000004,1325.183,216.09299999999999]
[427,"2,3,3,4-tetramethylpentane","C9H20",6.85961,1417.473,214.70500000000001]
[428,"nonyl-alcohol","C9H20O",6.6757,1276.6300000000001,123.06]
[429,"butyl-pentyl-sulfide","C9H20S",6.2344799999999996,1421.32,205.81]
[430,"ethyl-heptyl-sulfide","C9H20S",6.2344799999999996,1421.32,205.81]
[431,"hexyl-propyl-sulfide","C9H20S",6.2344799999999996,1421.32,205.81]
[432,"methyl-octyl-sulfide","C9H20S",6.2344799999999996,1421.32,205.81]
[433,"1-nonanethiol","C9H20S",6.9839000000000002,1655.6,183.7]
[434,"naphthalene","C10H8",7.01065,1733.71,201.85900000000001]
[435,"azulene","C10H8",6.7868000000000004,1733.71,201.85]
[436,"butylbenzene","C10H14",6.9831700000000003,1577.9649999999999,201.37799999999999]
[437,"m-diethylbenzene","C10H14",7.0035999999999996,1575.31,200.96]
[438,"o-diethylbenzene","C10H14",6.9878,1576.94,200.51]
[439,"p-diethylbenzene","C10H14",6.9981999999999998,1588.31,201.97]
[440,"1,2,3,4-tetramethylbenzene","C10H14",7.0594000000000001,1690.54,199.48]
[441,"1,2,3,5-tetramethylbenzene","C10H14",7.0778999999999996,1675.43,201.14]
[442,"1,2,4,5-tetramethylbenzene","C10H14",7.08,1672.43,201.43]
[443,"1-decyne","C10H18",7.1086999999999998,1606.6,206]
[444,"decahydronaphthalene,cis","C10H18",6.8752899999999997,1594.46,203.392]
[445,"decahydronaphthalene,trans","C10H18",6.8568100000000003,1564.683,206.25899999999999]
[446,"1-decene","C10H20",6.9603400000000004,1501.8720000000001,197.578]
[447,"1-cyclopentylpentane","C10H20",6.9413999999999998,1540.6,198.8]
[448,"butylcyclohexane","C10H20",6.9103000000000003,1538.518,200.833]
[449,"decanal","C10H20O",8.2079400000000007,2378.3159999999998,237.905]
[450,"decane","C10H22",6.9637500000000001,1508.75,195.374]
[451,"2-methylnonane","C10H22",6.9337200000000001,1472.73,196.38]
[452,"3-methylnonane","C10H22",6.9297500000000003,1479.1,197.5]
[453,"4-methylnonane","C10H22",6.9223400000000002,1471,198.3]
[454,"5-methylnonane","C10H22",6.9187799999999999,1468.4,198.5]
[455,"3-ethyloctane","C10H22",6.91845,1477.4,199.4]
[456,"4-ethyloctane","C10H22",6.9092200000000004,1466.68,200.44]
[457,"2,2-dimethyloctane","C10H22",6.9061700000000004,1439.6,200.7]
[458,"2,3-dimethyloctane","C10H22",6.8944900000000002,1462.22,200]
[459,"2,4-dimethyloctane","C10H22",6.9214599999999997,1439.8,200.4]
[460,"2,5-dimethyloctane","C10H22",6.9026300000000003,1442.5,200.2]
[461,"2,6-dimethyloctane","C10H22",6.9333099999999996,1450.53,199.4]
[462,"2,7-dimethyloctane","C10H22",6.9132600000000002,1444.19,198.27]
[463,"3,3-dimethyloctane","C10H22",6.8889500000000004,1457.6,202.5]
[464,"3,4-dimethyloctane","C10H22",6.8992599999999999,1465.9,201.4]
[465,"3,5-dimethyloctane","C10H22",6.8975799999999996,1448.8,201.3]
[466,"3,6-dimethyloctane","C10H22",6.9128400000000001,1456.9,200.5]
[467,"4,4-dimethyloctane","C10H22",6.8889100000000001,1446.9,203.5]
[468,"4,5-dimethyloctane","C10H22",6.8928799999999999,1460.52,201.9]
[469,"4-propylheptane","C10H22",6.9470999999999998,1458.7,201.2]
[470,"4-isopropylheptane","C10H22",6.8875700000000002,1449.8,202.9]
[471,"3-ethyl-2-methylheptane","C10H22",6.8929400000000003,1457.9,202.2]
[472,"4-ethyl-2-methylheptane","C10H22",6.8920000000000003,1438.2,202.3]
[473,"5-ethyl-2-methylheptane","C10H22",6.8942399999999999,1448.8,201.3]
[474,"3-ethyl-3-methylheptane","C10H22",6.88063,1472.9,204.5]
[475,"4-ethyl-3-methylheptane","C10H22",6.8868900000000002,1464.2,203.3]
[476,"3-ethyl-5-methylheptane","C10H22",6.9159300000000004,1455.2,202.4]
[477,"3-ethyl-4-methylheptane","C10H22",6.8882700000000003,1466.8,203]
[478,"4-ethyl-4-methylheptane","C10H22",6.8830200000000001,1464.9,205.2]
[479,"2,2,3-trimethylheptane","C10H22",6.87507,1446.1,204.4]
[480,"2,2,4-trimethylheptane","C10H22",6.8752500000000003,1409.4,204.5]
[481,"2,2,5-trimethylheptane","C10H22",6.8785499999999997,1417.4,203.8]
[482,"2,2,6-trimethylheptane","C10H22",6.8945400000000001,1411.09,202.63]
[483,"2,3,3-trimethylheptane","C10H22",6.87202,1457.8,205]
[484,"2,3,4-trimethylheptane","C10H22",6.8741700000000003,1451.7,203.6]
[485,"2,3,5-trimethylheptane","C10H22",6.8399000000000001,1440,203]
[486,"2,3,6-trimethylheptane","C10H22",6.8866800000000001,1433.7,201.9]
[487,"2,4,4-trimethylheptane","C10H22",6.8606199999999999,1418.4,205.4]
[488,"2,4,5-trimethylheptane","C10H22",6.8758299999999997,1437.3,203.3]
[489,"2,4,6-trimethylheptane","C10H22",6.9139499999999998,1411.3,202.3]
[490,"2,5,5-trimethylheptane","C10H22",6.8820399999999999,1429.09,204.36]
[491,"3,3,4-trimethylheptane","C10H22",6.8686100000000003,1466.8,205.9]
[492,"3,3,5-trimethylheptane","C10H22",6.8552400000000002,1435.43,205.49]
[493,"3,4,4-trimethylheptane","C10H22",6.86721,1464.1,206.2]
[494,"3,4,5-trimethylheptane","C10H22",6.87113,1463.4,204.2]
[495,"3-isopropyl-2-methylhexane","C10H22",6.7610299999999999,1441,204.7]
[496,"3,3-diethylhexane","C10H22",6.8835499999999996,1490.9,206.2]
[497,"3,4-diethylhexane","C10H22",6.88347,1473.2,204.2]
[498,"3-ethyl-2,2-dimethylhexane","C10H22",6.8659400000000002,1444.4,206.4]
[499,"4-ethyl-2,2-dimethylhexane","C10H22",6.8952600000000004,1416,206]
[500,"3-ethyl-2,3-dimethylhexane","C10H22",6.8612799999999998,1475.8,206.8]
[501,"4-ethyl-2,3-dimethylhexane","C10H22",6.8682299999999996,1458,204.7]
[502,"3-ethyl-2,4-dimethylhexane","C10H22",6.8668199999999997,1455.3,205]
[503,"4-ethyl-2,4-dimethylhexane","C10H22",6.86721,1464.1,206.2]
[504,"3-ethyl-2,5-dimethylhexane","C10H22",6.87155,1429.3,204.1]
[505,"4-ethyl-3,3-dimethylhexane","C10H22",6.8628799999999996,1473.1,207]
[506,"3-ethyl-3,4-dimethylhexane","C10H22",6.8614800000000002,1470.4,207.3]
[507,"2,2,3,3-tetramethylhexane","C10H22",6.8443800000000001,1464.03,209.06]
[508,"2,2,3,4-tetramethylhexane","C10H22",6.8240999999999996,1443.6,207.3]
[509,"2,2,3,5-tetramethylhexane","C10H22",6.8768500000000001,1417.6,206.3]
[510,"2,2,4,4-tetramethylhexane","C10H22",6.7315100000000001,1396,208.7]
[511,"2,2,4,5-tetramethylhexane","C10H22",6.83561,1400.55,206.26]
[512,"2,2,5,5-tetramethylhexane","C10H22",6.88124,1377.98,207]
[513,"2,3,3,4-tetramethylhexane","C10H22",6.8424300000000002,1474.94,207.72]
[514,"2,3,3,5-tetramethylhexane","C10H22",6.8504300000000002,1429.2,206.9]
[515,"2,3,4,4-tetramethylhexane","C10H22",6.8293999999999997,1457.9,207.6]
[516,"2,3,4,5-tetramethylhexane","C10H22",6.8715599999999997,1442.8,205.3]
[517,"3,3,4,4-tetramethylhexane","C10H22",6.8116399999999997,1492.7,209.7]
[518,"24dimethyl3isopropylpentane","C10H22",6.8215399999999997,1432.15,206.38]
[519,"33-diethyl-2-methylpentane","C10H22",6.8598400000000002,1501.8,207.7]
[520,"3ethyl-223trimethylpentane","C10H22",6.8071000000000002,1490.1,210]
[521,"3ethyl-224trimethylpentane","C10H22",6.8314899999999996,1435.6,208.1]
[522,"3ethyl-234trimethylpentane","C10H22",6.81616,1486.62,208.32]
[523,"22334-pentamethylpentane","C10H22",6.7965900000000001,1474.89,210.6]
[524,"22344-pentamethylpentane","C10H22",6.7327300000000001,1423.83,210.35]
[525,"decyl-alcohol","C10H22O",6.9223999999999997,1472.01,134.16]
[526,"butyl-hexyl-sulfide","C10H22S",6.0689799999999998,1421.32,205.81]
[527,"ethyl-octyl-sulfide","C10H22S",6.0689799999999998,1421.32,205.81]
[528,"heptyl-propyl-sulfide","C10H22S",6.0689799999999998,1421.32,205.81]
[529,"methyl-nonyl-sulfide","C10H22S",6.0689799999999998,1421.32,205.81]
[530,"pentyl-sulfide","C10H22S",6.0689799999999998,1421.32,205.81]
[531,"1-decanethiol","C10H22S",6.9981,1713.6,177]
[532,"pentyl-disulfide","C10H22S2",6.9581,1756,166.8]
[533,"1-methylnaphthalene","C11H10",7.03592,1826.9480000000001,195.00200000000001]
[533,"Acido n-butírico","C4H8O2",8.0919964577753625,1733.9890047671154,197.27436691746502]
[534,"2-methylnaphthalene","C11H10",7.0685000000000002,1840.268,198.39500000000001]
[535,"pentylbenzene","C11H16",6.9783299999999997,1639.91,194.76]
[536,"pentamethylbenzene","C11H16",7.1375999999999999,1833.8,198.96]
[537,"1-undecyne","C11H20",7.1306399999999996,1687.2,202]
[538,"1-undecene","C11H22",6.9666199999999998,1562.4690000000001,189.74299999999999]
[539,"1-cyclopentylhexane","C11H22",6.9547999999999996,1608,191.6]
[540,"pentylcyclohexane","C11H22",6.9466700000000001,1619.11,194.51]
[541,"undecane","C11H24",6.9722,1569.57,187.7]
[542,"undecyl-alcohol","C11H24O",6.5270999999999999,1250,100]
[543,"butyl-heptyl-sulfide","C11H24S",5.9321000000000002,1421.32,205.81]
[544,"decyl-methyl-sulfide","C11H24S",5.9321000000000002,1421.32,205.81]
[545,"ethyl-nonyl-sulfide","C11H24S",5.9321000000000002,1421.32,205.81]
[546,"octyl-propyl-sulfide","C11H24S",5.9321000000000002,1421.32,205.81]
[547,"1-undecanethiol","C11H24S",7.0122,1767.4,170.4]
[548,"biphenyl","C12H10",7.2454000000000001,1998.72,202.74]
[549,"1-ethylnaphthalene","C12H12",7.0315899999999996,1841.32,185.28]
[550,"2-ethylnaphthalene","C12H12",7.0756600000000001,1880.73,191.41]
[551,"1,2-dimethylnaphthalene","C12H12",7.0060500000000001,1805.31,171.37]
[552,"1,3-dimethylnaphthalene","C12H12",7.2698,2076,210]
[553,"1,4-dimethylnaphthalene","C12H12",7.2698,2076,210]
[554,"1,5-dimethylnaphthalene","C12H12",7.0492999999999997,1855,180]
[555,"1,6-dimethylnaphthalene","C12H12",7.2698,2076,210]
[556,"1,7-dimethylnaphthalene","C12H12",7.0564,1879,180]
[557,"2,3-dimethylnaphthalene","C12H12",7.0526999999999997,1869,180]
[558,"2,6-dimethylnaphthalene","C12H12",7.0460000000000003,1841,180]
[559,"2,7-dimethylnaphthalene","C12H12",7.0477999999999996,1846,180]
[560,"hexylbenzene","C12H18",6.9852999999999996,1700.5,188.2]
[561,"1,2,3-triethylbenzene","C12H18",7.5887700000000002,2133.5500000000002,235.68]
[562,"1,2,4-triethylbenzene","C12H18",7.5786899999999999,2133.558,235.68100000000001]
[563,"1,3,5-triethylbenzene","C12H18",7.6044,2133.5500000000002,235.68]
[564,"hexamethylbenzene","C12H18",7.1554399999999996,2133.5500000000002,235.68]
[565,"1-dodecyne","C12H22",7.1692900000000002,1771.1,198]
[566,"1-dodecene","C12H24",6.9752200000000002,1619.8620000000001,182.27099999999999]
[567,"1-cyclopentylheptane","C12H24",6.9743000000000004,1672.2,184.4]
[568,"1-cyclohexylhexane","C12H24",6.9554999999999998,1681,187.8]
[569,"dodecane","C12H26",6.9979500000000003,1639.27,181.83500000000001]
[570,"dodecyl-alcohol","C12H26O",7.53986,2003.29,168.13]
[571,"butyl-octyl-sulfide","C12H26S",6.6289999999999996,1408,116.06]
[572,"decyl-ethyl-sulfide","C12H26S",5.8125099999999996,1421.32,205.81]
[573,"hexyl-sulfide","C12H26S",5.8125099999999996,1421.32,205.81]
[574,"methyl-undecyl-sulfide","C12H26S",5.8125099999999996,1421.32,205.81]
[575,"nonyl-propyl-sulfide","C12H26S",5.8125099999999996,1421.32,205.81]
[576,"1-dodecanethiol","C12H26S",7.0244,1817.8,164.1]
[577,"hexyl-disulfide","C12H26S2",6.9631999999999996,1824.9,153.5]
[578,"1-propylnaphthalene","C13H14",7.0594000000000001,1890.8,180]
[579,"2-propylnaphthalene","C13H14",7.0605000000000002,1895.5,180]
[580,"2ethyl-3-methylnaphthalene","C13H14",7.0285099999999998,1895.5,180]
[581,"2ethyl-6-methylnaphthalene","C13H14",7.0930299999999997,1895.5,180]
[582,"2ethyl-7-methylnaphthalene","C13H14",7.0930299999999997,1895.5,180]
[583,"1-phenylheptane","C13H20",7.0006000000000004,1761.2,181.5]
[584,"1-tridecyne","C13H24",7.1567400000000001,1834.4,195]
[585,"1-tridecene","C13H26",6.9856299999999996,1674.741,175.214]
[586,"1-cyclopentyloctane","C13H26",6.9896000000000003,1729.8,177.3]
[587,"1-cyclohexylheptane","C13H26",6.9743000000000004,1743,180.9]
[588,"tridecane","C13H28",7.0075599999999998,1690.67,174.22]
[589,"1-tridecanol","C13H28O",7.41181,2003.29,168.13]
[590,"butyl-nonyl-sulfide","C13H28S",5.70756,1421.32,205.81]
[591,"decyl-propyl-sulfide","C13H28S",5.70756,1421.32,205.81]
[592,"dodecyl-methyl-sulfide","C13H28S",5.70756,1421.32,205.81]
[593,"ethyl-undecyl-sulfide","C13H28S",5.70756,1421.32,205.81]
[594,"1-tridecanethiol","C13H28S",7.0369999999999999,1864.9,157.9]
[595,"1-butylnaphthalene","C14H16",4.9630999999999998,656.8,26]
[596,"2-butylnaphthalene","C14H16",6.6116999999999999,1591.4,138.5]
[597,"1-phenyloctane","C14H22",7.0086000000000004,1812.2,174.6]
[598,"1,2,3,4-tetraethylbenzene","C14H22",7.65632,2312.864,236.261]
[599,"1,2,3,5-tetraethylbenzene","C14H22",7.6323499999999997,2312.86,236.26]
[600,"1,2,4,5-tetraethylbenzene","C14H22",7.6372299999999997,2312.86,236.26]
[601,"1-tetradecyne","C14H26",7.2322699999999998,1927.7,191]
[602,"1-tetradecene","C14H28",7.0200500000000003,1745.001,170.47499999999999]
[603,"1-cyclopentylnonane","C14H28",6.9960000000000004,1779,170.2]
[604,"1-cyclohexyloctane","C14H28",6.9897,1799.3,174.3]
[605,"tetradecane","C14H30",7.0129999999999999,1740.88,167.72]
[606,"1-tetradecanol","C14H30O",6.6741000000000001,1204.5,54]
[607,"butyl-decyl-sulfide","C14H30S",5.6151200000000001,1421.32,205.81]
[608,"dodecyl-ethyl-sulfide","C14H30S",5.6151200000000001,1421.32,205.81]
[609,"heptyl-sulfide","C14H30S",5.6151200000000001,1421.32,205.81]
[610,"methyl-tridecyl-sulfide","C14H30S",5.6151200000000001,1421.32,205.81]
[611,"propyl-undecyl-sulfide","C14H30S",5.6151200000000001,1421.32,205.81]
[612,"1-tetradecanethiol","C14H30S",7.0484999999999998,1909.2,151.9]
[613,"heptyl-disulfide","C14H30S2",6.9602000000000004,1878.6,139.80000000000001]
[614,"1-pentylnaphthalene","C15H18",7.0743,2000,170]
[615,"2-pentylnaphthalene","C15H18",7.06,2005.9,170]
[616,"1-phenylnonane","C15H24",7.0244999999999997,1862.6,167.5]
[617,"1-pentadecyne","C15H28",7.2055300000000004,1972.07,188]
[618,"1-pentadecene","C15H30",7.0155500000000002,1781.9739999999999,162.58199999999999]
[619,"1-cyclopentyldecane","C15H30",7.0034900000000002,1825.748,163.47900000000001]
[620,"1-cyclohexylnonane","C15H30",7.0006000000000004,1850.2,167.6]
[621,"pentadecane","C15H32",7.0235900000000004,1789.95,161.38]
[622,"1-pentadecanol","C15H32O",6.2373700000000003,1204.5,54]
[623,"butyl-undecyl-sulfide","C15H32S",5.5334700000000003,1421.32,205.81]
[624,"dodecyl-propyl-sulfide","C15H32S",5.5334700000000003,1421.32,205.81]
[625,"ethyl-tridecyl-sulfide","C15H32S",5.5334700000000003,1421.32,205.81]
[626,"methyl-tetradecyl-sulfide","C15H32S",5.5334700000000003,1421.32,205.81]
[627,"1-pentadecanethiol","C15H32S",7.0612000000000004,1951,146]
[628,"1-phenyldecane","C16H26",7.0364199999999997,1904.1320000000001,160.31800000000001]
[629,"pentaethylbenzene","C16H26",8.29495,2972.77,272.05200000000002]
[630,"1-hexadecyne","C16H30",7.4751099999999999,2154.6999999999998,185]
[631,"1-hexadecene","C16H32",7.0443699999999998,1843.5809999999999,157.917]
[632,"1-cyclopentylundecane","C16H32",7.02,1869.2,156]
[633,"1-cyclohexyldecane","C16H32",7.0185199999999996,1899.242,161.34800000000001]
[634,"hexadecane","C16H34",7.02867,1830.51,154.44999999999999]
[635,"1-hexadecanol","C16H34O",6.1585999999999999,1380,91]
[636,"butyl-dodecyl-sulfide","C16H34S",5.4612299999999996,1421.32,205.81]
[637,"ethyl-tetradecyl-sulfide","C16H34S",5.4612299999999996,1421.32,205.81]
[638,"methyl-pentadecyl-sulfide","C16H34S",5.4612299999999996,1421.32,205.81]
[639,"octyl-sulfide","C16H34S",5.4612299999999996,1421.32,205.81]
[640,"propyl-tridecyl-sulfide","C16H34S",5.4612299999999996,1421.32,205.81]
[641,"1-hexadecanethiol","C16H34S",7.0750000000000002,1990,140]
[642,"octyl-disulfide","C16H34S2",6.9579000000000004,1935.6,129]
[643,"1-phenylundecane","C17H28",7.0509000000000004,1944.1,153]
[644,"1-heptadecyne","C17H32",7.4882900000000001,2216.1999999999998,182]
[645,"1-heptadecene","C17H34",7.03925,1877.91,151.53]
[646,"1-cyclopentyldodecane","C17H34",7.0319000000000003,1909.1,149]
[647,"1-cyclohexylundecane","C17H34",7.0289999999999999,1939.7,154.5]
[648,"heptadecane","C17H36",7.0143000000000004,1865.1,149.19999999999999]
[649,"1-heptadecanol","C17H36O",6.782,1595,85.06]
[650,"butyl-tridecyl-sulfide","C17H36S",5.3972699999999998,1421.32,205.81]
[651,"ethyl-pentadecyl-sulfide","C17H36S",5.3972699999999998,1421.32,205.81]
[652,"hexadecyl-methyl-sulfide","C17H36S",5.3972699999999998,1421.32,205.81]
[653,"propyl-tetradecyl-sulfide","C17H36S",5.3972699999999998,1421.32,205.81]
[654,"1-heptadecanethiol","C17H36S",7.0810000000000004,2027,135]
[655,"1-phenyldodecane","C18H30",7.0693000000000001,1981.6,145.5]
[656,"hexaethylbenzene","C18H30",7.5028800000000002,2360.7330000000002,212.65199999999999]
[657,"1-octadecyne","C18H34",7.5078699999999996,2281.1,180]
[658,"1-octadecene","C18H36",7.0451800000000002,1917.9,145.9]
[659,"1-cycopentyltridecane","C18H36",7.0472999999999999,1947,141.9]
[660,"1-cyclohexyldodecane","C18H36",7.0362,1976.7,148]
[661,"octadecane","C18H38",7.0022000000000002,1894.3,143.30000000000001]
[662,"1-octadecanol","C18H38O",6.8140000000000001,1632,80.06]
[663,"butyl-tetradecyl-sulfide","C18H38S",5.3364000000000003,1421.32,205.81]
[664,"ethyl-hexadecyl-sulfide","C18H38S",5.3364000000000003,1421.32,205.81]
[665,"heptadecyl-methyl-sulfide","C18H38S",5.3364000000000003,1421.32,205.81]
[666,"nonyl-sulfide","C18H38S",5.3364000000000003,1421.32,205.81]
[667,"pentadecyl-propyl-sulfide","C18H38S",5.3364000000000003,1421.32,205.81]
[668,"1-octadecanethiol","C18H38S",7.0960000000000001,2061,129]
[669,"nonyl-disulfide","C18H38S2",6.9604999999999997,1981.5,117]
[670,"1-phenyltridecane","C19H32",7.0842999999999998,2013.9,137.9]
[671,"1-nonadecyne","C19H36",7.5171099999999997,2336.6999999999998,177]
[672,"1-nonadecene","C19H38",7.0571000000000002,1961.6,141.19999999999999]
[673,"1-cyclopentyltetradecane","C19H38",7.0629999999999997,1982,135]
[674,"1-cyclohexyltridecane","C19H38",7.0468999999999999,2012.2,141.5]
[675,"nonadecane","C19H40",7.0152999999999999,1932.8,137.6]
[676,"1-nonadecanol","C19H40O",6.6076899999999998,1632,80.06]
[677,"butyl-pentadecyl-sulfide","C19H40S",5.2824600000000004,1421.32,205.81]
[678,"ethyl-heptadecyl-sulfide","C19H40S",5.2824600000000004,1421.32,205.81]
[679,"hexadecyl-propyl-sulfide","C19H40S",5.2824600000000004,1421.32,205.81]
[680,"methyl-octadecyl-sulfide","C19H40S",5.2824600000000004,1421.32,205.81]
[681,"1-nonadecanethiol","C19H40S",7.1050000000000004,2094,124]
[682,"1-phenyltetradecane","C20H34",7.101,2042,130]
[683,"1-eicosyne","C20H38",7.5233600000000003,2386.3000000000002,174]
[684,"1-eicosene","C20H40",7.0576999999999996,1995.3,136]
[685,"1-cyclopentylpentadecane","C20H40",7.0830000000000002,2016,128]
[686,"1-cyclohexyltetradecane","C20H40",7.0609999999999999,2046,135]
[687,"eicosane","C20H42",7.1521999999999997,2032.7,132.1]
[688,"1-eicosanol","C20H42O",6.8719999999999999,1699,70.06]
[689,"butyl-hexadecyl-sulfide","C20H42S",5.2347299999999999,1421.32,205.81]
[690,"decyl-sulfide","C20H42S",5.2347299999999999,1421.32,205.81]
[691,"ethyl-octadecyl-sulfide","C20H42S",5.2347299999999999,1421.32,205.81]
[692,"heptadecyl-propyl-sulfide","C20H42S",5.2347299999999999,1421.32,205.81]
[693,"methyl-nonadecyl-sulfide","C20H42S",5.2347299999999999,1421.32,205.81]
[694,"1-eicosanethiol","C20H42S",7.1139999999999999,2125,119]
[695,"decyl-disulfide","C20H42S2",6.9720000000000004,2019,103.1]
[696,"1-phenylpentadecane","C21H36",7.1139999999999999,2067,122]
[697,"1-cyclopentylhexadecane","C21H42",7.1029999999999998,2048,121]
[698,"1-cyclohexylpentadecane","C21H42",7.0720000000000001,2078,129]
[699,"1-phenylhexadecane","C22H38",7.14,2095,114]
[700,"1-cyclohexylhexadecane","C22H44",7.0739999999999998,2099,122]
[701,"Argón","Ar",6.2767915717305884,304.62772762687769,269.11986815532515]
[702,"Kriptón","Kr",6.3005974824441573,416.92845549303433,266.2305444174612]
[703,"Xenón","Xe",6.3210480850937998,567.02790631996368,260.40156029124796]
[704,"Helio 4","He",2.8244983282146618,8.1655414978015184,275.5528920873636]
[705,"Hidrógeno","H2",4.9478714833909114,67.596721234767912,277.55629077668391]
[706,"Nitrógeno","N2 ",6.072218439072893,256.01678154680582,268.34468373784949]
[707,"Cloro","Cl2",6.8159728010635119,862.47455654539169,247.98854228153991]
[708,"Sulfuro de hidrógeno","H2S ",7.0944969234501816,807.99589167673912,253.08261131066581]
[709,"Dióxido de Azufre","SO2",7.3937568496719273,1001.2170676965392,238.78700257280252]
[710,"Trióxido de Azufre","SO3",10.360771887901935,1737.5957493194135,238.09235679610356]
[711,"Oxido Nitroso","N2O",6.9267650733344182,655.12179089022675,248.82413067959811]
[712,"Cloruro de hidrógeno","HCl",7.2053563018823663,746.76234098082307,260.62304155338387]
[713,"Agua","H2O",1085.9454548903245,-7.7824775899927499,1.4666489178639976]
[714,"Amoníaco","NH3",7.5249493949715163,927.35190052998428,241.78706694173439]
[715,"Oxígeno","O2",6.4024981883456533,319.43320373744979,268.49569368930577]
[716,"Oxido Nitroso","N2O",6.9267650733344182,655.12179089022675,248.82413067959811]
[717,"Oxido Nítrico","NO",9.844306094161805,683.8381663254122,270.07626451454837]
[718,"Acido Nítrico","HNO3"]
[719,"Acido Sulfurico","H2SO4"]
[720,"methyl-nitrite","CH3NO2"]
[721,"methyl-nitrate","CH3NO3"]
[722,"Cianuro de hidrógeno","CNH"]